program: Orca
programVersion: 4.2.1
elementType: Cl F F F O N N N C C C C C C C C C C C C C C C H H H H H H H H H H H H H H H
charge: 0
multiplicity: 1
keywords: wb97x-d3
keywords: def2-TZVPP
keywords: def2/J RIJCOSX GRIDX6 NOFINALGRIDX
keywords: grid4 nofinalgrid
keywords: scfconv7
keywords: smallprint printgap noloewdin
keywords: NOSOSCF
formula: C15H15ClF3N3O
InChI: InChI=1S/C15H15ClF3N3O/c1-2-7-23-9-14(22-6-5-20-10-22)21-13-4-3-11(16)8-12(13)15(17,18)19/h3-6,8,10H,2,7,9H2,1H3
38 atoms
Cl -5.320609 1.349761 -0.369474
F  -2.221181 -2.120599 1.815323
F  -0.865486 -2.668038 0.243783
F  -0.270243 -1.226496 1.728116
O  2.289739 2.055527 0.64755
N  2.54627 -0.20039 -1.142795
N  0.29176 -0.342118 -0.987759
N  4.683661 -0.420949 -1.654252
C  1.318249 0.381147 -0.843118
C  1.352682 1.8191 -0.351044
C  1.966176 1.547211 1.934265
C  -1.004636 0.102956 -0.803301
C  2.708512 0.269488 2.288549
C  -1.842514 -0.531783 0.123803
C  -1.546147 1.106005 -1.606711
C  -3.164356 -0.136954 0.258624
C  2.7544 -1.542194 -1.396974
C  4.221593 0.429594 2.315182
C  3.761988 0.41878 -1.317767
C  -1.298987 -1.641972 0.975608
C  -2.867788 1.493078 -1.481551
C  -3.67215 0.873468 -0.541285
C  4.070658 -1.64855 -1.698961
H  0.340217 2.090741 -0.029874
H  1.602371 2.476828 -1.190206
H  0.883473 1.391524 2.022291
H  2.235842 2.330578 2.648911
H  2.354961 -0.03432 3.278188
H  2.427396 -0.542258 1.61442
H  -0.924272 1.569084 -2.362155
H  -3.810745 -0.614118 0.980891
H  1.956499 -2.259473 -1.329227
H  4.524771 1.211023 3.01486
H  4.703251 -0.496551 2.627023
H  4.622062 0.687012 1.335762
H  3.906315 1.477401 -1.180353
H  -3.268654 2.27118 -2.116304
H  4.620159 -2.54197 -1.947708
totalener: -1579.95378327 hartree
nucrepener: 2184.55494072 hartree
electener: -3764.50872399 hartree
oneelecener: -6510.80905095 hartree
twoeener: 2746.30032696 hartree
kineticenergy: 1574.94563316 hartree
xcener: -123.752896769197 hartree
chargesum: -0.0000000
charge: -0.065413 -0.171757 -0.160594 -0.169932 -0.333371 -0.018356 -0.277938 -0.287628 0.162337 -0.028873 0.015511 0.142122 -0.129227 -0.185356 -0.191027 -0.076425 -0.109167 -0.237870 0.009194 0.549179 -0.098112 0.075228 -0.073344 0.118709 0.127840 0.076553 0.096697 0.076288 0.066185 0.140181 0.131318 0.164250 0.072831 0.087798 0.096098 0.147512 0.127420 0.131137
qa: -0.0654 -0.1718 -0.1606 -0.1699 -0.3334 -0.0184 -0.2779 -0.2876 0.1623 -0.0289 0.0155 0.1421 -0.1292 -0.1854 -0.1910 -0.0764 -0.1092 -0.2379 0.0092 0.5492 -0.0981 0.0752 -0.0733 0.1187 0.1278 0.0766 0.0967 0.0763 0.0662 0.1402 0.1313 0.1643 0.0728 0.0878 0.0961 0.1475 0.1274 0.1311
va: 1.2399 1.1327 1.1451 1.1206 1.9544 3.2952 2.9841 3.1183 3.8163 4.0219 3.9032 3.9255 3.8931 3.8844 3.9919 3.9572 3.8758 3.9198 4.0565 4.4235 4.0163 3.9435 4.0371 0.9983 0.9834 1.0067 0.9960 1.0147 1.0103 1.0000 1.0249 1.0133 1.0032 1.0081 1.0130 1.0060 1.0099 1.0079
dispcorr: -0.021247108 hartree
energy: -1579.975030376856
dipole: 34.96519 -35.71907 -0.75387 12.32204 -11.39025 0.93180 3.94846 -3.88866 0.05980
magnitude: 1.20006 au
magnitude: 3.05031 debye
