program: Orca
programVersion: 4.2.1
elementType: Cl F F F O N N N C C C C C C C C C C C C C C C H H H H H H H H H H H H H H H
charge: 0
multiplicity: 1
keywords: wb97x-d3
keywords: def2-TZVPP
keywords: def2/J RIJCOSX GRIDX6 NOFINALGRIDX
keywords: grid4 nofinalgrid
keywords: scfconv7
keywords: smallprint printgap noloewdin
keywords: NOSOSCF
formula: C15H15ClF3N3O
InChI: InChI=1S/C15H15ClF3N3O/c1-2-7-23-9-14(22-6-5-20-10-22)21-13-4-3-11(16)8-12(13)15(17,18)19/h3-6,8,10H,2,7,9H2,1H3
38 atoms
Cl -4.823546 1.886629 -0.20015
F  -1.173273 -2.940309 -0.468971
F  -0.58146 -2.077281 1.41228
F  -2.636728 -2.607452 1.06759
O  2.287818 1.596187 0.756478
N  2.663032 -1.030314 -0.516917
N  0.463946 -0.621283 -0.908653
N  4.02614 -2.406729 -1.576739
C  1.470713 -0.398594 -0.181911
C  1.499622 0.480214 1.044764
C  2.331976 2.530932 1.811336
C  -0.766415 -0.020835 -0.684323
C  3.19047 3.70731 1.397371
C  -1.806293 -0.712691 -0.053103
C  -1.009052 1.265572 -1.159801
C  -3.052088 -0.12045 0.095084
C  3.91137 -0.871647 0.056843
C  2.660423 4.446403 0.176737
C  2.810868 -1.976465 -1.502739
C  -1.553377 -2.090506 0.483537
C  -2.251179 1.855434 -1.014386
C  -3.270023 1.158644 -0.386506
C  4.724049 -1.723757 -0.612819
H  1.893719 -0.096778 1.895211
H  0.473369 0.766055 1.303617
H  2.739743 2.063701 2.719695
H  1.315507 2.873227 2.056613
H  3.246029 4.387848 2.25081
H  4.211548 3.362739 1.21477
H  -0.211527 1.79819 -1.660282
H  -3.857458 -0.646935 0.586584
H  4.112197 -0.164473 0.840225
H  2.648414 3.806177 -0.703728
H  1.64352 4.806052 0.343028
H  3.280642 5.312175 -0.052673
H  1.975858 -2.298077 -2.103043
H  -2.42494 2.854744 -1.389065
H  5.778829 -1.885022 -0.459632
totalener: -1579.95718190 hartree
nucrepener: 2136.59423384 hartree
electener: -3716.55141574 hartree
oneelecener: -6414.84740020 hartree
twoeener: 2698.29598445 hartree
kineticenergy: 1574.95357340 hartree
xcener: -123.749716977241 hartree
chargesum: -0.0000000
charge: -0.068909 -0.158491 -0.179514 -0.170306 -0.322477 -0.041682 -0.287795 -0.293468 0.233323 -0.031699 0.005838 0.062277 -0.101893 -0.164566 -0.148973 -0.088339 -0.108699 -0.242211 0.057049 0.563035 -0.105535 0.081509 -0.084723 0.127658 0.116417 0.083178 0.079775 0.060636 0.064607 0.132469 0.130527 0.144642 0.089410 0.067705 0.089187 0.152646 0.127582 0.129806
qa: -0.0689 -0.1585 -0.1795 -0.1703 -0.3225 -0.0417 -0.2878 -0.2935 0.2333 -0.0317 0.0058 0.0623 -0.1019 -0.1646 -0.1490 -0.0883 -0.1087 -0.2422 0.0570 0.5630 -0.1055 0.0815 -0.0847 0.1277 0.1164 0.0832 0.0798 0.0606 0.0646 0.1325 0.1305 0.1446 0.0894 0.0677 0.0892 0.1526 0.1276 0.1298
va: 1.2353 1.1504 1.1152 1.1354 1.9445 3.3522 3.0096 3.1368 3.9370 3.9415 3.8984 4.0403 3.9435 3.8748 3.9824 3.9781 3.9037 3.9243 4.0279 4.4188 4.0109 3.9221 4.0475 0.9910 1.0025 0.9959 0.9929 1.0116 1.0129 1.0086 1.0259 1.0104 1.0117 1.0050 1.0072 1.0148 1.0096 1.0078
dispcorr: -0.018350578 hartree
energy: -1579.975532481435
dipole: 35.31588 -35.21434 0.10154 29.56804 -27.70115 1.86689 4.77050 -3.62248 1.14802
magnitude: 2.19397 au
magnitude: 5.57664 debye
