program: Orca
programVersion: 4.2.1
elementType: Cl F F F O N N N C C C C C C C C C C C C C C C H H H H H H H H H H H H H H H
charge: 0
multiplicity: 1
keywords: wb97x-d3
keywords: def2-TZVPP
keywords: def2/J RIJCOSX GRIDX6 NOFINALGRIDX
keywords: grid4 nofinalgrid
keywords: scfconv7
keywords: smallprint printgap noloewdin
keywords: NOSOSCF
formula: C15H15ClF3N3O
InChI: InChI=1S/C15H15ClF3N3O/c1-2-7-23-9-14(22-6-5-20-10-22)21-13-4-3-11(16)8-12(13)15(17,18)19/h3-6,8,10H,2,7,9H2,1H3
38 atoms
Cl -4.597291 1.945972 0.682424
F  -1.245663 -3.078217 0.326699
F  -2.743588 -2.519697 -1.107129
F  -0.674095 -2.084523 -1.495686
O  2.30501 1.662477 -0.15517
N  2.756803 -1.276323 0.391182
N  0.563005 -0.897631 0.842933
N  4.061742 -2.920519 1.072447
C  1.589655 -0.546236 0.199128
C  1.663635 0.592355 -0.789817
C  2.341483 2.84712 -0.922378
C  -0.636758 -0.207203 0.754142
C  1.03402 3.625392 -0.910661
C  -1.749991 -0.787263 0.135573
C  -0.776737 1.045124 1.348483
C  -2.964793 -0.118915 0.112108
C  4.035783 -0.966758 -0.031868
C  1.144501 4.898922 -1.736866
C  2.850019 -2.47305 1.058484
C  -1.605689 -2.124209 -0.53047
C  -1.989643 1.708945 1.331314
C  -3.080696 1.123743 0.711615
C  4.812845 -1.988408 0.402887
H  0.644977 0.839354 -1.106246
H  2.206572 0.267593 -1.689224
H  2.637489 2.627095 -1.958837
H  3.135475 3.459676 -0.489683
H  0.215884 3.012397 -1.298024
H  0.773876 3.868695 0.122072
H  0.078055 1.49252 1.837569
H  -3.825816 -0.556685 -0.371929
H  4.277396 -0.056657 -0.550124
H  1.933451 5.552646 -1.361983
H  1.367756 4.679886 -2.782013
H  0.213949 5.46394 -1.714102
H  1.981107 -2.949321 1.482245
H  -2.083881 2.679391 1.79876
H  5.876613 -2.107782 0.275764
totalener: -1579.95485040 hartree
nucrepener: 2143.92128746 hartree
electener: -3723.87613786 hartree
oneelecener: -6429.45959091 hartree
twoeener: 2705.58345305 hartree
kineticenergy: 1574.95864267 hartree
xcener: -123.751699814129 hartree
chargesum: -0.0000000
charge: -0.068853 -0.159162 -0.171509 -0.177744 -0.315832 -0.040284 -0.299049 -0.294473 0.252346 -0.068201 0.008601 0.116902 -0.080564 -0.165558 -0.194961 -0.088451 -0.118108 -0.254949 0.058838 0.556696 -0.104610 0.087234 -0.082812 0.124964 0.125255 0.063956 0.099721 0.054592 0.059371 0.135907 0.131022 0.150681 0.079438 0.078157 0.093089 0.152156 0.126350 0.129844
qa: -0.0689 -0.1592 -0.1715 -0.1777 -0.3158 -0.0403 -0.2990 -0.2945 0.2523 -0.0682 0.0086 0.1169 -0.0806 -0.1656 -0.1950 -0.0885 -0.1181 -0.2549 0.0588 0.5567 -0.1046 0.0872 -0.0828 0.1250 0.1253 0.0640 0.0997 0.0546 0.0594 0.1359 0.1310 0.1507 0.0794 0.0782 0.0931 0.1522 0.1264 0.1298
va: 1.2362 1.1496 1.1332 1.1175 1.9540 3.3563 3.0220 3.1358 3.8975 3.9621 3.9233 3.9620 3.8574 3.8799 3.9705 3.9736 3.8987 3.9644 4.0290 4.4293 3.9914 3.9277 4.0437 0.9925 0.9944 0.9977 0.9976 1.0109 1.0118 1.0166 1.0257 1.0075 1.0036 1.0034 1.0045 1.0140 1.0102 1.0074
dispcorr: -0.019088437 hartree
energy: -1579.973938838487
dipole: 29.13348 -29.03868 0.09480 31.41997 -29.20972 2.21025 -6.59626 5.74076 -0.85550
magnitude: 2.37194 au
magnitude: 6.02898 debye
