program: Orca
programVersion: 4.2.1
elementType: Cl F F F O N N N C C C C C C C C C C C C C C C H H H H H H H H H H H H H H H
charge: 0
multiplicity: 1
keywords: wb97x-d3
keywords: def2-TZVPP
keywords: def2/J RIJCOSX GRIDX6 NOFINALGRIDX
keywords: grid4 nofinalgrid
keywords: scfconv7
keywords: smallprint printgap noloewdin
keywords: NOSOSCF
formula: C15H15ClF3N3O
InChI: InChI=1S/C15H15ClF3N3O/c1-2-7-23-9-14(22-6-5-20-10-22)21-13-4-3-11(16)8-12(13)15(17,18)19/h3-6,8,10H,2,7,9H2,1H3
38 atoms
Cl -4.735762 1.96867 0.054095
F  -2.826668 -2.748493 0.863089
F  -1.365292 -2.972719 -0.694378
F  -0.747229 -2.411439 1.290699
O  2.278287 1.704637 0.560309
N  2.681154 -1.090345 -0.44846
N  0.454929 -0.719439 -0.692145
N  4.818276 -1.630951 -0.585683
C  1.517568 -0.427758 -0.076966
C  1.645415 0.562069 1.056029
C  2.37837 2.739216 1.513786
C  -0.746928 -0.069835 -0.46097
C  3.020998 3.950266 0.871653
C  -1.854586 -0.78302 0.012423
C  -0.903798 1.278335 -0.77818
C  -3.076758 -0.149639 0.175721
C  2.767407 -2.123314 -1.360412
C  2.228328 4.505887 -0.302647
C  3.964668 -0.842502 -0.023251
C  -1.699058 -2.234117 0.363756
C  -2.125532 1.908124 -0.624711
C  -3.208068 1.19107 -0.145223
C  4.083915 -2.438002 -1.419537
H  2.208763 0.105519 1.883324
H  0.644739 0.787737 1.443663
H  2.972865 2.406573 2.377396
H  1.379281 3.001273 1.894369
H  3.122584 4.713547 1.646745
H  4.035833 3.697996 0.555869
H  -0.05601 1.830809 -1.161668
H  -3.932476 -0.690997 0.552249
H  1.894809 -2.521865 -1.845569
H  2.688894 5.415422 -0.686765
H  2.176623 3.792913 -1.123961
H  1.207011 4.75466 -0.008535
H  4.206747 -0.057344 0.674043
H  -2.233134 2.953583 -0.878393
H  4.553237 -3.2047 -2.01437
totalener: -1579.95797915 hartree
nucrepener: 2131.83729194 hartree
electener: -3711.79527109 hartree
oneelecener: -6405.35233807 hartree
twoeener: 2693.55706698 hartree
kineticenergy: 1574.95544938 hartree
xcener: -123.750159654081 hartree
chargesum: -0.0000000
charge: -0.068650 -0.172632 -0.160900 -0.175607 -0.316555 -0.050014 -0.298949 -0.295538 0.258882 -0.077491 0.006116 0.103601 -0.095188 -0.161237 -0.174506 -0.082234 -0.101792 -0.254786 0.050273 0.550882 -0.112024 0.081399 -0.077766 0.124443 0.127875 0.085055 0.078757 0.060306 0.067239 0.143072 0.131332 0.166748 0.094173 0.089650 0.068901 0.129656 0.126141 0.131367
qa: -0.0687 -0.1726 -0.1609 -0.1756 -0.3166 -0.0500 -0.2989 -0.2955 0.2589 -0.0775 0.0061 0.1036 -0.0952 -0.1612 -0.1745 -0.0822 -0.1018 -0.2548 0.0503 0.5509 -0.1120 0.0814 -0.0778 0.1244 0.1279 0.0851 0.0788 0.0603 0.0672 0.1431 0.1313 0.1667 0.0942 0.0897 0.0689 0.1297 0.1261 0.1314
va: 1.2360 1.1314 1.1467 1.1213 1.9377 3.3635 3.0124 3.1404 3.8906 3.9816 3.8963 3.9697 3.9323 3.8819 3.9737 3.9656 3.8866 3.9262 4.0695 4.4380 4.0256 3.9299 4.0372 0.9933 0.9931 0.9972 0.9928 1.0116 1.0139 1.0053 1.0252 1.0119 1.0086 1.0093 1.0038 1.0086 1.0110 1.0076
dispcorr: -0.018495252 hartree
energy: -1579.976474401115
dipole: 34.13469 -34.30570 -0.17101 30.02969 -28.49893 1.53076 1.58063 -0.93129 0.64934
magnitude: 1.67156 au
magnitude: 4.24876 debye
