program: Gaussian 09
title: 000003134
version: EM64L-G09RevD.01
frameworkgroup: C1[X(C7H9N5)]
method: RPBEPBE
basis: SDD
operation: Freq
keyword: #p
keyword: freq=noraman
keyword: PBEPBE/SDD
title: #p freq=noraman PBEPBE/SDD
converged: YES YES NO NO
title: Mulliken charges:
elementType: N N N N N C C C C C C C H H H H H H H H H
charge: -0.130664 -0.408165 -0.107276 -0.024561 0.030347 0.138185 0.248977 -0.110507 -0.662573 -0.647224 -0.226170 -0.396188 0.321921 0.250626 0.231458 0.231789 0.225013 0.224828 0.305012 0.262209 0.242962
chargesum: 0.00000
title: Mulliken charges with hydrogens summed into heavy atoms:
elementType: N N N N N C C C C C C C
charge: -0.130664 -0.086244 -0.107276 -0.024561 0.030347 0.138185 0.248977 -0.110507 0.051300 0.107629 0.036040 -0.153225
polarizability: 1.48009732e+02 3.32974553e-02 1.26409046e+02 -4.53293585e-02 -1.28641942e-01 5.41986064e+01
1716.lowfreq: -7.4070 0.0006 0.0007 0.0007 5.3436 9.5427 38.0851 91.7527 132.3150
frequency: 37.6690 91.7276 132.3101 175.3874 206.4968 216.4258 236.5951 297.0621 351.2131 361.6740 502.9191 524.5983 561.1374 578.7453 608.4346 618.8122 668.6333 673.0899 788.4125 818.0817 829.8202 899.8860 906.3759 931.3537 1037.8809 1057.4237 1090.8229 1096.8284 1118.4682 1135.2705 1177.0433 1239.0680 1260.0271 1294.9732 1301.6914 1332.3800 1343.7681 1392.4886 1410.4719 1418.1272 1439.1377 1453.5154 1480.1448 1481.3682 1497.6639 1499.7979 1520.3793 1594.3355 2940.7722 2966.3488 3012.2286 3041.7289 3103.5275 3120.3578 3159.1988 3231.1689 3606.4949
redmass: 2.3523 2.6087 1.5871 1.2125 3.7285 5.0636 2.3348 5.5728 3.3147 3.6237 4.1918 7.6117 3.9584 1.9360 6.0625 1.8233 7.5182 6.5906 5.8919 8.7403 1.6036 4.6281 7.4493 1.4229 2.5417 1.4508 2.3902 1.2205 3.9398 1.3310 2.2986 2.1828 4.7190 5.5560 7.4875 3.2541 2.0988 2.8427 1.4657 1.2975 1.7232 1.8675 1.2239 1.2218 1.0465 1.0918 5.1334 6.1818 1.0384 1.0364 1.1021 1.1023 1.0938 1.0967 1.0918 1.0986 1.0816
irintensity: 1.4084 0.0126 3.7613 2.5462 1.5358 0.9926 12.7625 0.4061 5.2373 0.4963 0.2656 4.2810 0.0696 97.2523 7.6457 9.3793 2.0303 4.3762 0.8291 10.7059 23.0618 12.1105 0.8726 14.9203 86.0233 33.2818 5.9103 0.0276 6.0588 0.0768 7.1362 38.0214 26.6964 5.9621 42.4754 5.7286 108.6146 88.3385 41.0383 14.0750 24.7071 45.3298 18.5716 20.2645 6.6253 8.2110 110.1901 447.6943 54.5994 101.8390 39.5524 39.6209 16.0086 0.6851 24.1638 1.8185 32.4867
temp: 298.150 k
press: 1.00000 atm
elementType: 7 7 7 7 7 6 6 6 6 6 6 6 1 1 1 1 1 1 1 1 1
symmnumber: 1
zpe: 429888.6 jmol-1
zpe.correction: 0.163736 hartree
zpe.thermalcorrener: 0.174205 hartree
zpe.thermalcorrenthalpy: 0.175149 hartree
zpe.thermalcorrgfe: 0.127141 hartree
zpe.sumelectzpe: -545.015437 hartree
zpe.sumelectthermal: -545.004969 hartree
zpe.sumelectthermalent: -545.004025 hartree
zpe.sumelectthermalfe: -545.052032 hartree
dipole: -5.7455 -6.5704 0.0179
dipole: 8.7282
quadrupole: -77.5446 -61.2233 -72.1941
quadrupole: -4.8778 0.0184 -0.0040
quadrupole: -7.2239 9.0973 -1.8734 -4.8778 0.0184 -0.0040
hfenergy: -545.1791732 hartree
pointgroup: C01 [X(C7H9N5)]
dipole: 2.4429655 -2.3257613 -0.64401 debye
dipolederiv: -1.4379801 0.3353735 0.0749526 0.3389547 -0.5515959 -0.0616638 0.06329 -0.0532184 -0.33956 -0.484583 0.151604 0.0399736 0.0180478 -0.5090292 -0.086485 -0.0036104 -0.0840742 -0.2415768 -0.8226393 0.0852924 0.0113045 0.5461337 -0.7170579 -0.1332728 0.1453003 -0.1435292 -0.2680003 -0.3329797 -0.1392487 -0.0432152 0.0930257 -0.6058777 -0.0999359 0.0261324 -0.1060846 -0.2978959 -0.596601 -0.1059567 -0.0407219 0.0319252 -0.6402215 -0.1292049 0.0013037 -0.1310833 -0.2501373 -0.8440324 0.0990352 0.0079948 -0.0591963 0.2447936 0.0658657 -0.0357715 0.0709303 0.043922 1.8234931 -0.4904095 -0.105581 -0.5649588 0.4996091 0.0775431 -0.1255599 0.0782857 0.2199906 0.448022 0.2936854 0.0977142 -0.0393684 0.6357092 0.1698155 -0.0010922 0.1772035 0.1241222 0.0793019 -0.030703 -0.0141395 -0.2736344 0.4804542 0.0598602 -0.0840388 0.0636692 0.2940612 0.4657866 0.1469274 0.0447553 0.389047 0.0256566 -0.0606821 0.122473 -0.0678595 0.2396611 0.5668868 -0.2407406 -0.0575444 -0.3286709 0.307421 0.102067 -0.0843575 0.1027887 -0.0271584 0.7550014 0.0040657 0.0202342 -0.160617 0.5683822 0.1882639 -0.0289127 0.1917645 -0.0155871 0.1764301 0.0424118 0.0097183 0.0325226 0.1920809 -0.0380766 0.0074416 -0.0378796 0.3076957 -0.1246909 0.0777954 0.0119205 0.0013294 0.0996374 -0.007378 -0.0109095 -0.0036353 0.118745 0.0832966 -0.0703757 -0.115821 0.0550384 -0.029999 -0.0416582 -0.0290419 -0.0884956 -0.1293617 0.0734372 -0.1352391 0.0685605 0.0158534 -0.1081559 0.0462269 0.0656426 0.0806378 -0.0296911 -0.1246643 -0.0412442 0.0763258 -0.0533177 0.1171254 -0.0098528 0.1558936 0.0255179 -0.0937581 -0.114873 0.0065734 -0.0889362 0.0412213 0.0614003 0.1118432 -0.1590768 0.0767351 -0.0457036 0.231857 0.0521823 0.0180361 -0.0554635 0.0130558 -0.0349381 -0.0142948 -0.0333204 0.1189429 0.0972077 -0.0363947 -0.0131444 -0.040665 0.0092582 -0.0526842 -0.0139316 -0.0521721 0.1633924 0.0823233 -0.0046342 -0.0023869 0.0127929 -0.092647 -0.0656533 0.0031205 -0.0661806 0.1078971 unknown
polarizability: 147.8512806|0.8682856|120.4950533|2.4683154|19.9787947|60.2710505 unknown
InChI: InChI=1S/C7H9N5/c1-12(2)7-5-6(9-3-8-5)10-4-11-7/h3-4,8H,1-2H3
charge 0 multiplicity 1
21 atoms
N  2.137213 -0.305648 0.048218
N  -0.743815 -1.749909 -0.461568
N  0.771104 1.554839 0.568872
N  -2.693952 -0.594568 -0.160833
N  -1.681091 1.560725 0.515046
C  -0.359745 -0.456591 -0.058671
C  0.868679 0.241902 0.179754
C  -1.600352 0.248978 0.123179
C  2.337583 -1.702097 -0.355854
C  3.336115 0.513046 0.3051
C  -2.139533 -1.766519 -0.502714
C  -0.464445 2.128399 0.712197
H  -0.133711 -2.532264 -0.685908
H  3.417977 -1.913792 -0.369797
H  1.953148 -1.900598 -1.377434
H  1.875988 -2.411887 0.360309
H  3.964264 0.584688 -0.603608
H  3.939153 0.07551 1.123917
H  3.003457 1.519313 0.597771
H  -2.697882 -2.65657 -0.786684
H  -0.459856 3.176745 1.026107
