program: Orca
programVersion: 4.2.1
elementType: Cl O O N N N C C C C C C C C C C C C C C C C C C C H H H H H H H H H H H H H H H H H H H H H H H H
charge: 0
multiplicity: 1
keywords: wb97x-d3
keywords: def2-TZVPP
keywords: def2/J RIJCOSX GRIDX6 NOFINALGRIDX
keywords: grid4 nofinalgrid
keywords: scfconv7
keywords: smallprint printgap noloewdin
keywords: NOSOSCF
formula: C19H24ClN3O2
InChI: InChI=1S/C19H24ClN3O2/c1-18(2)13-25-19(3,23(18)17(24)22-12-11-21-14-22)10-4-5-15-6-8-16(20)9-7-15/h6-9,11-12,14H,4-5,10,13H2,1-3H3
49 atoms
Cl -5.317009 3.599006 1.410684
O  1.858909 1.386114 0.582329
O  3.28606 -2.213647 -1.580599
N  2.581991 -0.62821 -0.11791
N  1.596839 -2.761703 -0.16973
N  -0.043525 -4.229486 -0.21284
C  1.542952 0.022201 0.742782
C  3.623575 0.355194 -0.506978
C  3.257845 1.488043 0.448229
C  0.104618 -0.166079 0.269476
C  1.678978 -0.362421 2.212878
C  5.03637 -0.136315 -0.233415
C  3.464045 0.817545 -1.953484
C  -0.160323 0.135071 -1.198056
C  2.556724 -1.835661 -0.68535
C  -1.62418 -0.100573 -1.580608
C  -2.571323 0.807314 -0.848038
C  1.622496 -3.40408 1.044154
C  0.58778 -3.314827 -0.891876
C  -2.665625 2.154366 -1.193014
C  -3.346209 0.345985 0.211709
C  0.602098 -4.301592 0.993618
C  -3.50397 3.018648 -0.506588
C  -4.192404 1.194512 0.912406
C  -4.262369 2.527641 0.545278
H  3.766408 1.378219 1.414351
H  3.50496 2.469421 0.044179
H  -0.497551 0.500161 0.89402
H  -0.238538 -1.171175 0.521295
H  1.298554 -1.361026 2.410167
H  1.089381 0.330266 2.814354
H  2.711954 -0.321222 2.55822
H  5.3667 -0.88063 -0.953907
H  5.125237 -0.556424 0.769081
H  5.723114 0.709116 -0.29932
H  4.198141 1.596879 -2.162369
H  3.62965 0.01116 -2.663343
H  2.474472 1.237928 -2.135685
H  0.110236 1.168761 -1.425408
H  0.459743 -0.488283 -1.847552
H  -1.888677 -1.143768 -1.387068
H  -1.729863 0.052052 -2.65684
H  2.369894 -3.202382 1.791955
H  0.361263 -3.004181 -1.899883
H  -2.077054 2.542372 -2.015876
H  -3.294995 -0.69645 0.50168
H  0.304093 -4.997807 1.760671
H  -3.565468 4.059963 -0.792256
H  -4.786876 0.815036 1.732272
elementType: Cl O N C H
totalener: -1513.51201136 hartree
nucrepener: 2429.55513266 hartree
electener: -3943.06714402 hartree
oneelecener: -6895.98054885 hartree
twoeener: 2952.91340483 hartree
cpcmener: -0.03681847 hartree
kineticenergy: 1508.16377635 hartree
xcener: -124.309403140027 hartree
chargesum: 0.0000000
charge: -0.107921 -0.386829 -0.474989 -0.034878 -0.013043 -0.380341 0.220991 0.129597 0.071644 -0.157348 -0.314974 -0.320995 -0.354551 -0.168245 0.336615 -0.103999 0.028361 -0.153745 0.027357 -0.212877 -0.199675 -0.123074 -0.154757 -0.139657 0.088251 0.085511 0.115321 0.109211 0.092499 0.117503 0.113450 0.110818 0.106438 0.101398 0.114804 0.112214 0.111380 0.112386 0.093378 0.090156 0.092917 0.106799 0.196291 0.172278 0.144678 0.139656 0.168730 0.145305 0.145964
qa: -0.1079 -0.3868 -0.4750 -0.0349 -0.0130 -0.3803 0.2210 0.1296 0.0716 -0.1573 -0.3150 -0.3210 -0.3546 -0.1682 0.3366 -0.1040 0.0284 -0.1537 0.0274 -0.2129 -0.1997 -0.1231 -0.1548 -0.1397 0.0883 0.0855 0.1153 0.1092 0.0925 0.1175 0.1135 0.1108 0.1064 0.1014 0.1148 0.1122 0.1114 0.1124 0.0934 0.0902 0.0929 0.1068 0.1963 0.1723 0.1447 0.1397 0.1687 0.1453 0.1460
va: 1.1973 1.9597 2.0270 3.1371 3.2433 3.0989 4.1428 3.9111 3.8971 3.6795 3.9516 3.9177 3.9264 3.8945 4.2665 3.8350 3.5495 3.9106 4.0342 3.9834 3.9382 4.0342 3.9805 3.9752 3.8143 1.0040 0.9930 1.0269 1.0078 1.0008 1.0095 1.0044 1.0152 1.0043 0.9995 1.0025 1.0182 0.9980 1.0234 1.0135 1.0146 1.0049 0.9791 0.9985 1.0021 1.0047 1.0014 1.0043 1.0036
dispcorr: -0.030137925 hartree
energy: -1513.542149288938
dipole: 30.29463 -28.54030 1.75433 -5.63739 7.13133 1.49394 -4.59584 5.47970 0.88386
magnitude: 2.46794 au
magnitude: 6.27300 debye
