program: Orca
programVersion: 4.2.1
elementType: Cl O O N N N C C C C C C C C C C C C C C C C C C C H H H H H H H H H H H H H H H H H H H H H H H H
charge: 0
multiplicity: 1
keywords: wb97x-d3
keywords: def2-TZVPP
keywords: def2/J RIJCOSX GRIDX6 NOFINALGRIDX
keywords: grid4 nofinalgrid
keywords: scfconv7
keywords: smallprint printgap noloewdin
keywords: NOSOSCF
formula: C19H24ClN3O2
InChI: InChI=1S/C19H24ClN3O2/c1-18(2)13-25-19(3,23(18)17(24)22-12-11-21-14-22)10-4-5-15-6-8-16(20)9-7-15/h6-9,11-12,14H,4-5,10,13H2,1-3H3
49 atoms
Cl -5.406636 3.347161 1.543585
O  1.956237 1.428938 0.569326
O  3.301881 -2.213472 -1.567373
N  2.619122 -0.611539 -0.112386
N  1.533573 -2.693887 -0.232589
N  -0.192562 -4.053243 -0.367737
C  1.587823 0.078311 0.725849
C  3.712647 0.328551 -0.464633
C  3.361104 1.478645 0.475698
C  0.151658 -0.057328 0.228608
C  1.683551 -0.308866 2.198801
C  5.093607 -0.220902 -0.142114
C  3.62078 0.795598 -1.91578
C  -0.084199 0.280206 -1.236472
C  2.559298 -1.811841 -0.69323
C  -1.534217 0.027084 -1.658902
C  -2.524583 0.843493 -0.877005
C  1.453327 -3.33558 0.979073
C  0.530494 -3.180339 -1.009092
C  -2.650844 2.212507 -1.105169
C  -3.310548 0.269064 0.117236
C  0.380346 -4.164397 0.871935
C  -3.531881 2.988696 -0.368455
C  -4.198853 1.028016 0.866705
C  -4.300302 2.385926 0.61591
H  3.836013 1.355473 1.456602
H  3.65622 2.448104 0.076061
H  -0.440116 0.614819 0.85638
H  -0.22457 -1.055714 0.457408
H  1.257564 -1.289908 2.390458
H  1.114699 0.408722 2.790496
H  2.711301 -0.312379 2.561007
H  5.817743 0.594456 -0.179656
H  5.417282 -0.977655 -0.852804
H  5.128061 -0.647428 0.860823
H  4.386661 1.550598 -2.097953
H  3.785816 -0.016366 -2.619644
H  2.652003 1.246927 -2.132607
H  0.173667 1.324256 -1.427282
H  0.560322 -0.3140 -1.889407
H  -1.764806 -1.035645 -1.544747
H  -1.630811 0.252557 -2.723241
H  2.171972 -3.185235 1.765897
H  0.377593 -2.854061 -2.025953
H  -2.05386 2.688153 -1.874239
H  -3.234613 -0.792916 0.316901
H  -0.00167 -4.841562 1.618689
H  -3.618198 4.04913 -0.562823
H  -4.801307 0.561367 1.634172
elementType: Cl O N C H
totalener: -1513.51202947 hartree
nucrepener: 2433.73505984 hartree
electener: -3947.24708932 hartree
oneelecener: -6904.35745917 hartree
twoeener: 2957.11036985 hartree
cpcmener: -0.03656692 hartree
kineticenergy: 1508.16524828 hartree
xcener: -124.310055034268 hartree
chargesum: -0.0000000
charge: -0.107455 -0.386324 -0.476176 -0.036842 -0.011363 -0.378619 0.214365 0.135968 0.074170 -0.154128 -0.312781 -0.322945 -0.358946 -0.158002 0.338543 -0.114096 0.023484 -0.154790 0.023764 -0.205713 -0.187622 -0.124746 -0.154239 -0.147265 0.090784 0.085082 0.114554 0.108660 0.090427 0.116553 0.113460 0.110763 0.115504 0.105834 0.101564 0.112074 0.111856 0.112129 0.093946 0.088308 0.092568 0.106900 0.196313 0.175577 0.143858 0.136147 0.168504 0.145008 0.145386
qa: -0.1075 -0.3863 -0.4762 -0.0368 -0.0114 -0.3786 0.2144 0.1360 0.0742 -0.1541 -0.3128 -0.3229 -0.3589 -0.1580 0.3385 -0.1141 0.0235 -0.1548 0.0238 -0.2057 -0.1876 -0.1247 -0.1542 -0.1473 0.0908 0.0851 0.1146 0.1087 0.0904 0.1166 0.1135 0.1108 0.1155 0.1058 0.1016 0.1121 0.1119 0.1121 0.0939 0.0883 0.0926 0.1069 0.1963 0.1756 0.1439 0.1361 0.1685 0.1450 0.1454
va: 1.1977 1.9603 2.0259 3.1388 3.2403 3.0932 4.1481 3.9013 3.8922 3.6853 3.9507 3.9193 3.9283 3.8800 4.2658 3.8383 3.5513 3.9084 4.0301 3.9793 3.9335 4.0318 3.9810 3.9865 3.8102 1.0042 0.9932 1.0250 1.0074 1.0012 1.0095 1.0042 0.9992 1.0152 1.0039 1.0026 1.0177 0.9982 1.0229 1.0141 1.0151 1.0051 0.9792 0.9962 1.0025 1.0068 1.0015 1.0043 1.0039
dispcorr: -0.030302263 hartree
energy: -1513.542331737200
dipole: 31.22285 -29.37764 1.84521 -4.66802 6.15968 1.49166 -4.85881 5.78414 0.92533
magnitude: 2.54678 au
magnitude: 6.47341 debye
