program: Orca
programVersion: 4.2.1
elementType: Cl O O N N N C C C C C C C C C C C C C C C C C C C H H H H H H H H H H H H H H H H H H H H H H H H
charge: 0
multiplicity: 1
keywords: wb97x-d3
keywords: def2-TZVPP
keywords: def2/J RIJCOSX GRIDX6 NOFINALGRIDX
keywords: grid4 nofinalgrid
keywords: scfconv7
keywords: smallprint printgap noloewdin
keywords: NOSOSCF
formula: C19H24ClN3O2
InChI: InChI=1S/C19H24ClN3O2/c1-18(2)13-25-19(3,23(18)17(24)22-12-11-21-14-22)10-4-5-15-6-8-16(20)9-7-15/h6-9,11-12,14H,4-5,10,13H2,1-3H3
49 atoms
Cl -5.477867 -0.687658 -0.259923
O  3.26862 1.433207 1.032846
O  1.748497 -1.427961 -1.970307
N  2.491709 -0.333282 -0.125966
N  0.51271 -1.605433 -0.080628
N  -1.568325 -2.256341 0.235716
C  2.241868 0.471767 1.111542
C  3.802395 0.023791 -0.72268
C  4.388528 0.813841 0.444592
C  0.910369 1.217408 1.11395
C  2.406129 -0.335907 2.396227
C  4.656255 -1.197943 -1.025743
C  3.668961 0.926288 -1.94757
C  0.642582 2.102954 -0.094392
C  1.632811 -1.100091 -0.805186
C  -0.656525 2.904302 0.044584
C  -1.884469 2.041493 -0.017328
C  0.541854 -2.508774 0.95779
C  -0.784387 -1.513295 -0.487552
C  -2.429574 1.682307 -1.24804
C  -2.483915 1.542675 1.135845
C  -0.74994 -2.889961 1.134452
C  -3.533828 0.848138 -1.333638
C  -3.586319 0.703862 1.071676
C  -4.100338 0.361364 -0.166897
H  4.906219 0.157377 1.154649
H  5.089765 1.581373 0.119797
H  0.913508 1.837704 2.015747
H  0.099118 0.503495 1.262132
H  3.270559 -0.998842 2.364154
H  1.52761 -0.937131 2.614367
H  2.536926 0.353932 3.230035
H  4.307259 -1.742528 -1.900617
H  4.684811 -1.882928 -0.178001
H  5.679373 -0.87737 -1.227483
H  3.188233 0.419368 -2.780655
H  3.103649 1.830987 -1.723753
H  4.663815 1.23076 -2.27515
H  1.465432 2.807907 -0.223014
H  0.594413 1.513932 -1.015246
H  -0.693684 3.644312 -0.757179
H  -0.637423 3.461993 0.984338
H  1.455197 -2.826557 1.429215
H  -1.087225 -0.878585 -1.30536
H  -1.987678 2.060663 -2.162309
H  -2.088554 1.812162 2.107885
H  -1.132735 -3.5920 1.857875
H  -3.944439 0.584402 -2.298884
H  -4.034145 0.323195 1.97938
elementType: Cl O N C H
totalener: -1513.50935122 hartree
nucrepener: 2518.28930644 hartree
electener: -4031.79865766 hartree
oneelecener: -7074.40594805 hartree
twoeener: 3042.60729039 hartree
cpcmener: -0.03580008 hartree
kineticenergy: 1508.17016247 hartree
xcener: -124.311287556791 hartree
chargesum: -0.0000000
charge: -0.114469 -0.384016 -0.478027 -0.044876 -0.008328 -0.354439 0.251826 0.126740 0.074210 -0.200837 -0.322574 -0.321504 -0.356953 -0.128295 0.335013 -0.107092 0.096929 -0.161562 0.011795 -0.293602 -0.210200 -0.115819 -0.131224 -0.161094 0.126669 0.085484 0.113207 0.111530 0.087132 0.110680 0.116730 0.114208 0.106287 0.100603 0.116341 0.110616 0.114131 0.112120 0.087258 0.078202 0.100158 0.094255 0.197952 0.176439 0.139977 0.149000 0.166892 0.143634 0.138889
qa: -0.1145 -0.3840 -0.4780 -0.0449 -0.0083 -0.3544 0.2518 0.1267 0.0742 -0.2008 -0.3226 -0.3215 -0.3570 -0.1283 0.3350 -0.1071 0.0969 -0.1616 0.0118 -0.2936 -0.2102 -0.1158 -0.1312 -0.1611 0.1267 0.0855 0.1132 0.1115 0.0871 0.1107 0.1167 0.1142 0.1063 0.1006 0.1163 0.1106 0.1141 0.1121 0.0873 0.0782 0.1002 0.0943 0.1980 0.1764 0.1400 0.1490 0.1669 0.1436 0.1389
va: 1.1886 1.9627 2.0196 3.1252 3.2501 3.0932 4.1144 3.9193 3.8939 3.7385 3.9402 3.9190 3.9185 3.8997 4.2636 3.8469 3.4585 3.8998 4.0315 3.9733 3.9239 4.0144 3.9236 3.9998 3.7441 1.0038 0.9938 1.0204 1.0073 1.0041 0.9984 1.0131 1.0140 1.0050 0.9990 1.0199 0.9977 1.0024 1.0290 1.0103 1.0052 1.0101 0.9779 0.9991 1.0053 0.9957 0.9981 1.0034 1.0064
dispcorr: -0.032841004 hartree
energy: -1513.542192219423
dipole: 37.66299 -34.46424 3.19875 10.60945 -9.07527 1.53418 3.50747 -2.09265 1.41483
magnitude: 3.81936 au
magnitude: 9.70803 debye
