program: Orca
programVersion: 4.2.1
elementType: Cl O O N N N C C C C C C C C C C C C C C C C C C C H H H H H H H H H H H H H H H H H H H H H H H H
charge: 0
multiplicity: 1
keywords: wb97x-d3
keywords: def2-TZVPP
keywords: def2/J RIJCOSX GRIDX6 NOFINALGRIDX
keywords: grid4 nofinalgrid
keywords: scfconv7
keywords: smallprint printgap noloewdin
keywords: NOSOSCF
formula: C19H24ClN3O2
InChI: InChI=1S/C19H24ClN3O2/c1-18(2)13-25-19(3,23(18)17(24)22-12-11-21-14-22)10-4-5-15-6-8-16(20)9-7-15/h6-9,11-12,14H,4-5,10,13H2,1-3H3
49 atoms
Cl -5.251012 -0.751729 -0.39143
O  3.17528 1.313118 0.969983
O  2.521111 -2.418679 -1.378266
N  2.507303 -0.42396 -0.300877
N  0.674515 -1.892508 -0.15844
N  -0.903433 -2.976061 0.928233
C  2.027478 0.527167 0.753131
C  3.80932 0.024039 -0.849078
C  3.853531 1.431736 -0.258344
C  0.871916 1.37289 0.217327
C  1.700209 -0.138584 2.080561
C  4.960125 -0.819005 -0.305577
C  3.834697 0.092399 -2.368523
C  0.399691 2.474275 1.155819
C  1.987389 -1.598197 -0.658728
C  -0.819724 3.207177 0.58469
C  -1.970512 2.273112 0.331142
C  -0.519282 -1.50408 -0.720164
C  0.381516 -2.79413 0.812423
C  -2.664288 1.700071 1.395003
C  -2.3279 1.900225 -0.960923
C  -1.475183 -2.177447 -0.026352
C  -3.67605 0.777228 1.183355
C  -3.340162 0.979925 -1.19566
C  -4.003615 0.424327 -0.116072
H  4.869961 1.774139 -0.070824
H  3.365807 2.157307 -0.919527
H  0.03308 0.707271 0.021883
H  1.146766 1.8078 -0.748387
H  0.68858 -0.535547 2.110546
H  1.774874 0.59991 2.87806
H  2.403736 -0.938892 2.308873
H  4.89528 -1.853288 -0.636934
H  4.982787 -0.808172 0.784693
H  5.907955 -0.415936 -0.664027
H  2.951345 0.598755 -2.758917
H  4.708617 0.66649 -2.680295
H  3.906374 -0.888484 -2.831296
H  0.132475 2.056943 2.13001
H  1.196491 3.198997 1.333759
H  -0.541788 3.707829 -0.34567
H  -1.120687 3.989447 1.285069
H  -0.575039 -0.823003 -1.552203
H  1.146728 -3.270254 1.405176
H  -2.411037 1.970662 2.413199
H  -1.803079 2.326649 -1.807157
H  -2.542657 -2.134634 -0.168461
H  -4.200948 0.340714 2.022155
H  -3.599284 0.700594 -2.207888
elementType: Cl O N C H
totalener: -1513.51033485 hartree
nucrepener: 2502.61331531 hartree
electener: -4016.12365017 hartree
oneelecener: -7042.08956832 hartree
twoeener: 3025.96591816 hartree
cpcmener: -0.03839427 hartree
kineticenergy: 1508.17867435 hartree
xcener: -124.312914198742 hartree
chargesum: -0.0000000
charge: -0.115023 -0.388726 -0.483458 -0.058212 -0.035290 -0.381360 0.351206 0.133619 0.058785 -0.161265 -0.367015 -0.343690 -0.321254 -0.150224 0.380813 -0.101551 0.054979 -0.117784 0.026967 -0.214067 -0.172229 -0.122374 -0.139048 -0.170367 0.087512 0.119024 0.086204 -0.009719 0.104307 0.105495 0.118590 0.123473 0.106339 0.106877 0.107901 0.101831 0.114010 0.106313 0.089710 0.084410 0.088978 0.103377 0.194815 0.179542 0.141044 0.141029 0.148494 0.143059 0.143950
qa: -0.1150 -0.3887 -0.4835 -0.0582 -0.0353 -0.3814 0.3512 0.1336 0.0588 -0.1613 -0.3670 -0.3437 -0.3213 -0.1502 0.3808 -0.1016 0.0550 -0.1178 0.0270 -0.2141 -0.1722 -0.1224 -0.1390 -0.1704 0.0875 0.1190 0.0862 -0.0097 0.1043 0.1055 0.1186 0.1235 0.1063 0.1069 0.1079 0.1018 0.1140 0.1063 0.0897 0.0844 0.0890 0.1034 0.1948 0.1795 0.1410 0.1410 0.1485 0.1431 0.1440
va: 1.1861 1.9596 2.0197 3.1551 3.2840 3.1145 3.9926 3.9145 3.9190 3.8866 3.9671 3.9363 3.9146 3.8860 4.2458 3.8525 3.5361 3.8750 4.0370 3.9691 3.8937 4.0338 3.9466 3.9656 3.7552 0.9915 1.0013 1.0684 1.0138 0.9940 1.0085 1.0024 1.0167 1.0067 1.0015 1.0036 0.9998 1.0170 1.0020 1.0302 1.0109 1.0046 0.9800 0.9947 1.0022 1.0027 1.0240 1.0046 1.0049
dispcorr: -0.032350380 hartree
energy: -1513.542685232865
dipole: 32.72515 -30.81145 1.91370 15.29732 -11.95739 3.33993 1.73561 -1.88965 -0.15404
magnitude: 3.85242 au
magnitude: 9.79207 debye
