program: Orca
programVersion: 4.2.1
elementType: Cl O O N N N C C C C C C C C C C C C C C C C C C C H H H H H H H H H H H H H H H H H H H H H H H H
charge: 0
multiplicity: 1
keywords: wb97x-d3
keywords: def2-TZVPP
keywords: def2/J RIJCOSX GRIDX6 NOFINALGRIDX
keywords: grid4 nofinalgrid
keywords: scfconv7
keywords: smallprint printgap noloewdin
keywords: NOSOSCF
formula: C19H24ClN3O2
InChI: InChI=1S/C19H24ClN3O2/c1-18(2)13-25-19(3,23(18)17(24)22-12-11-21-14-22)10-4-5-15-6-8-16(20)9-7-15/h6-9,11-12,14H,4-5,10,13H2,1-3H3
49 atoms
Cl -6.301869 1.956846 -1.705364
O  2.914277 1.645354 -0.025017
O  1.851483 -1.598821 2.299186
N  2.439326 -0.516147 0.39475
N  1.775724 -2.765239 0.350751
N  1.908675 -4.890606 -0.204712
C  2.583167 0.809748 1.059417
C  2.941509 -0.463447 -1.00297
C  3.676532 0.876501 -0.925472
C  1.282462 1.324482 1.671209
C  3.712117 0.813716 2.086105
C  3.924999 -1.568206 -1.363317
C  1.819695 -0.37854 -2.03337
C  0.061095 1.253296 0.76678
C  2.032454 -1.572848 1.097644
C  -1.159286 1.855583 1.44616
C  -2.425319 1.858531 0.628539
C  0.659154 -3.03745 -0.402895
C  2.478781 -3.921761 0.453211
C  -2.502801 1.331098 -0.656521
C  -3.583306 2.41594 1.173148
C  0.766848 -4.351224 -0.736827
C  -3.688849 1.355821 -1.380393
C  -4.774577 2.451155 0.469057
C  -4.81688 1.917401 -0.810925
H  4.705602 0.741247 -0.570633
H  3.715136 1.384771 -1.888017
H  1.466569 2.364359 1.956958
H  1.087728 0.790799 2.601646
H  3.857036 1.830711 2.451725
H  4.654683 0.471404 1.657804
H  3.484443 0.182855 2.941038
H  4.631641 -1.76603 -0.556722
H  4.501843 -1.24798 -2.232585
H  3.436099 -2.500685 -1.638964
H  1.11887 0.42467 -1.808703
H  2.25059 -0.178009 -3.014833
H  1.262961 -1.30966 -2.114663
H  0.25911 1.781584 -0.168514
H  -0.151481 0.212708 0.505082
H  -0.936393 2.885497 1.741321
H  -1.352113 1.320386 2.381255
H  -0.108477 -2.307323 -0.596563
H  3.404554 -3.98421 1.003703
H  -1.633389 0.888843 -1.124983
H  -3.555983 2.835029 2.171986
H  0.079228 -4.936989 -1.325162
H  -3.722275 0.939557 -2.378099
H  -5.657372 2.890772 0.913133
elementType: Cl O N C H
totalener: -1513.51103126 hartree
nucrepener: 2385.41601650 hartree
electener: -3898.92704776 hartree
oneelecener: -6807.38829019 hartree
twoeener: 2908.46124243 hartree
cpcmener: -0.03793830 hartree
kineticenergy: 1508.16090300 hartree
xcener: -124.309873244756 hartree
chargesum: -0.0000000
charge: -0.108657 -0.396158 -0.475873 -0.042346 -0.019624 -0.380371 0.318992 0.104130 0.080398 -0.243528 -0.310631 -0.345470 -0.363159 -0.034677 0.344447 -0.110763 0.052306 -0.149003 0.028247 -0.192820 -0.217711 -0.129450 -0.193414 -0.171201 0.114689 0.085820 0.113653 0.100295 0.095739 0.109812 0.103048 0.108430 0.115025 0.124748 0.102585 0.114911 0.118507 0.122770 0.077600 0.056298 0.092748 0.093263 0.189280 0.180856 0.138106 0.140984 0.170678 0.142078 0.144414
qa: -0.1087 -0.3962 -0.4759 -0.0423 -0.0196 -0.3804 0.3190 0.1041 0.0804 -0.2435 -0.3106 -0.3455 -0.3632 -0.0347 0.3444 -0.1108 0.0523 -0.1490 0.0282 -0.1928 -0.2177 -0.1294 -0.1934 -0.1712 0.1147 0.0858 0.1137 0.1003 0.0957 0.1098 0.1030 0.1084 0.1150 0.1247 0.1026 0.1149 0.1185 0.1228 0.0776 0.0563 0.0927 0.0933 0.1893 0.1809 0.1381 0.1410 0.1707 0.1421 0.1444
va: 1.1968 1.9643 2.0295 3.1486 3.2440 3.1127 3.9910 3.9053 3.8903 3.7921 3.9511 3.9496 3.9373 3.8589 4.2646 3.8906 3.6251 3.9087 4.0427 3.9314 4.0217 4.0524 4.0700 3.9877 3.7877 1.0053 0.9934 1.0208 1.0283 1.0068 1.0042 1.0189 1.0000 1.0023 0.9962 0.9988 1.0049 0.9991 1.0128 1.0093 1.0017 0.9991 0.9808 0.9955 1.0038 1.0035 1.0014 1.0081 1.0051
dispcorr: -0.028823068 hartree
energy: -1513.539854328115
dipole: 33.61639 -31.83904 1.77735 1.10298 0.83208 1.93506 3.00702 -3.82935 -0.82233
magnitude: 2.75312 au
magnitude: 6.99786 debye
