program: Orca
programVersion: 4.2.1
elementType: Cl O O N N N C C C C C C C C C C C C C C C C C C C H H H H H H H H H H H H H H H H H H H H H H H H
charge: 0
multiplicity: 1
keywords: wb97x-d3
keywords: def2-TZVPP
keywords: def2/J RIJCOSX GRIDX6 NOFINALGRIDX
keywords: grid4 nofinalgrid
keywords: scfconv7
keywords: smallprint printgap noloewdin
keywords: NOSOSCF
formula: C19H24ClN3O2
InChI: InChI=1S/C19H24ClN3O2/c1-18(2)13-25-19(3,23(18)17(24)22-12-11-21-14-22)10-4-5-15-6-8-16(20)9-7-15/h6-9,11-12,14H,4-5,10,13H2,1-3H3
49 atoms
Cl -4.885673 4.993753 0.803831
O  1.529939 1.147421 0.804203
O  0.628217 -2.881226 0.823395
N  1.834402 -1.03694 0.287042
N  2.496482 -3.168441 -0.434804
N  4.257092 -4.422554 -0.846499
C  0.999812 -0.12399 1.115172
C  2.830275 -0.273412 -0.508977
C  2.165978 1.100374 -0.450829
C  -0.500076 -0.172493 0.788277
C  1.224994 -0.359225 2.60043
C  4.194227 -0.218593 0.17282
C  2.959896 -0.706382 -1.961915
C  -0.896853 -0.230232 -0.680424
C  1.573114 -2.344267 0.279093
C  -2.418392 -0.241149 -0.8654
C  -3.063278 1.050608 -0.449598
C  2.198395 -3.891326 -1.563209
C  3.74105 -3.539216 -0.039402
C  -3.722576 1.178555 0.769432
C  -2.981213 2.172916 -1.271957
C  3.306487 -4.640024 -1.808727
C  -4.284909 2.38475 1.164737
C  -3.536296 3.386302 -0.897053
C  -4.185348 3.480789 0.324486
H  2.895768 1.908064 -0.507337
H  1.456696 1.230105 -1.275504
H  -0.92241 0.724508 1.250423
H  -0.954188 -1.01532 1.309407
H  0.685924 0.392769 3.177842
H  2.283081 -0.289883 2.852899
H  0.858314 -1.334816 2.911663
H  4.121389 0.117338 1.207406
H  4.83619 0.482528 -0.361426
H  4.698746 -1.182301 0.162473
H  1.988805 -0.911693 -2.413761
H  3.413529 0.113139 -2.521909
H  3.603605 -1.572715 -2.098388
H  -0.489681 0.616966 -1.235695
H  -0.495666 -1.130969 -1.150805
H  -2.84876 -1.071308 -0.300061
H  -2.637923 -0.432878 -1.917901
H  1.262381 -3.788837 -2.086106
H  4.192828 -3.171044 0.867612
H  -3.80388 0.323351 1.429307
H  -2.477696 2.103497 -2.229033
H  3.46928 -5.32352 -2.626287
H  -4.794083 2.461998 2.115741
H  -3.465301 4.243728 -1.552472
elementType: Cl O N C H
totalener: -1513.51014627 hartree
nucrepener: 2391.17029903 hartree
electener: -3904.68044530 hartree
oneelecener: -6819.11189321 hartree
twoeener: 2914.43144791 hartree
cpcmener: -0.03795497 hartree
kineticenergy: 1508.16740436 hartree
xcener: -124.309980023218 hartree
chargesum: -0.0000000
charge: -0.108096 -0.396347 -0.476867 -0.065228 -0.022518 -0.379638 0.343790 0.140461 0.029917 -0.225963 -0.311313 -0.339712 -0.331550 -0.127010 0.332999 -0.098951 0.043339 -0.132318 0.021785 -0.219935 -0.224960 -0.129947 -0.129556 -0.150596 0.079329 0.115316 0.089256 0.095807 0.087483 0.114857 0.106928 0.101727 0.115994 0.111243 0.113811 0.111217 0.124514 0.103466 0.089437 0.085830 0.093068 0.104701 0.184801 0.182239 0.144061 0.144014 0.168069 0.145725 0.145319
qa: -0.1081 -0.3963 -0.4769 -0.0652 -0.0225 -0.3796 0.3438 0.1405 0.0299 -0.2260 -0.3113 -0.3397 -0.3316 -0.1270 0.3330 -0.0990 0.0433 -0.1323 0.0218 -0.2199 -0.2250 -0.1299 -0.1296 -0.1506 0.0793 0.1153 0.0893 0.0958 0.0875 0.1149 0.1069 0.1017 0.1160 0.1112 0.1138 0.1112 0.1245 0.1035 0.0894 0.0858 0.0931 0.1047 0.1848 0.1822 0.1441 0.1440 0.1681 0.1457 0.1453
va: 1.1971 1.9567 2.0203 3.1369 3.2495 3.1049 3.9956 3.8766 3.9502 3.8184 3.9528 3.9540 3.9377 3.8988 4.2804 3.8549 3.5385 3.9024 4.0492 3.9424 3.9870 4.0164 3.9606 3.9763 3.8224 0.9939 0.9906 1.0280 1.0308 1.0011 1.0048 1.0129 1.0031 1.0015 1.0013 0.9995 1.0042 0.9956 1.0029 1.0171 1.0088 1.0040 0.9916 0.9873 1.0024 1.0026 1.0011 1.0035 1.0039
dispcorr: -0.029326706 hartree
energy: -1513.539472973229
dipole: 22.82926 -22.35899 0.47027 -12.76583 13.92821 1.16238 -5.51767 4.33728 -1.18039
magnitude: 1.72209 au
magnitude: 4.37721 debye
