program: Orca
programVersion: 4.2.1
elementType: Cl O O N N N C C C C C C C C C C C C C C C C C C C H H H H H H H H H H H H H H H H H H H H H H H H
charge: 0
multiplicity: 1
keywords: wb97x-d3
keywords: def2-TZVPP
keywords: def2/J RIJCOSX GRIDX6 NOFINALGRIDX
keywords: grid4 nofinalgrid
keywords: scfconv7
keywords: smallprint printgap noloewdin
keywords: NOSOSCF
formula: C19H24ClN3O2
InChI: InChI=1S/C19H24ClN3O2/c1-18(2)13-25-19(3,23(18)17(24)22-12-11-21-14-22)10-4-5-15-6-8-16(20)9-7-15/h6-9,11-12,14H,4-5,10,13H2,1-3H3
49 atoms
Cl -4.893014 5.028617 0.669973
O  1.587993 1.219271 0.581905
O  0.64207 -2.779759 1.004564
N  1.856358 -1.009883 0.269465
N  2.466261 -3.208105 -0.276471
N  4.202383 -4.51008 -0.640268
C  1.065758 -0.01068 1.040246
C  2.8343 -0.338136 -0.626806
C  2.182937 1.041724 -0.681929
C  -0.446646 -0.071345 0.787726
C  1.35788 -0.104748 2.5288
C  4.21931 -0.232547 0.00336
C  2.912219 -0.907097 -2.035608
C  -0.908655 -0.235628 -0.653428
C  1.577194 -2.308049 0.38753
C  -2.436348 -0.279922 -0.766503
C  -3.081462 1.028763 -0.408174
C  2.118836 -4.029406 -1.320405
C  3.723577 -3.550563 0.100868
C  -3.041743 2.098822 -1.300546
C  -3.696558 1.226415 0.824422
C  3.212289 -4.807539 -1.538858
C  -3.594391 3.328752 -0.980164
C  -4.255912 2.450486 1.165903
C  -4.197921 3.493435 0.257175
H  2.917631 1.831871 -0.840961
H  1.44743 1.095943 -1.492969
H  -0.842071 0.863309 1.196771
H  -0.882391 -0.8657 1.393502
H  1.003804 -1.044252 2.947926
H  0.847089 0.702115 3.056146
H  2.42675 -0.018508 2.725522
H  4.714375 -1.198053 0.079287
H  4.183262 0.211103 0.998493
H  4.850583 0.400703 -0.62096
H  3.544429 -1.788871 -2.114546
H  1.924522 -1.141001 -2.434562
H  3.352639 -0.146764 -2.683041
H  -0.541717 0.579379 -1.281374
H  -0.513653 -1.160059 -1.08222
H  -2.827074 -1.075442 -0.127215
H  -2.700624 -0.546504 -1.792166
H  1.164007 -3.966206 -1.814245
H  4.211942 -3.103216 0.951488
H  -2.5733 1.974362 -2.269716
H  -3.744468 0.413185 1.538375
H  3.337412 -5.564732 -2.295923
H  -3.555609 4.144468 -1.68925
H  -4.729408 2.582136 2.129261
elementType: Cl O N C H
totalener: -1513.51029041 hartree
nucrepener: 2390.12746713 hartree
electener: -3903.63775754 hartree
oneelecener: -6817.04350715 hartree
twoeener: 2913.40574961 hartree
cpcmener: -0.03795276 hartree
kineticenergy: 1508.16414367 hartree
xcener: -124.309369934986 hartree
chargesum: 0.0000000
charge: -0.108415 -0.397350 -0.476967 -0.067943 -0.021676 -0.380004 0.343683 0.148128 0.026160 -0.223485 -0.309560 -0.339973 -0.334116 -0.129168 0.332884 -0.097808 0.039353 -0.132679 0.021758 -0.222647 -0.216334 -0.128689 -0.152555 -0.130739 0.080929 0.116013 0.088873 0.094854 0.087613 0.101028 0.114281 0.107604 0.114055 0.114977 0.111049 0.103183 0.111171 0.125932 0.091251 0.085705 0.091962 0.104851 0.184816 0.181790 0.144120 0.143474 0.167889 0.145369 0.145352
qa: -0.1084 -0.3974 -0.4770 -0.0679 -0.0217 -0.3800 0.3437 0.1481 0.0262 -0.2235 -0.3096 -0.3400 -0.3341 -0.1292 0.3329 -0.0978 0.0394 -0.1327 0.0218 -0.2226 -0.2163 -0.1287 -0.1526 -0.1307 0.0809 0.1160 0.0889 0.0949 0.0876 0.1010 0.1143 0.1076 0.1141 0.1150 0.1110 0.1032 0.1112 0.1259 0.0913 0.0857 0.0920 0.1049 0.1848 0.1818 0.1441 0.1435 0.1679 0.1454 0.1454
va: 1.1967 1.9558 2.0202 3.1378 3.2498 3.1047 3.9980 3.8679 3.9526 3.8158 3.9538 3.9544 3.9383 3.8949 4.2819 3.8552 3.5475 3.9019 4.0502 3.9851 3.9419 4.0164 3.9778 3.9624 3.8207 0.9940 0.9895 1.0273 1.0316 1.0127 1.0012 1.0042 1.0011 1.0034 1.0013 0.9961 0.9999 1.0037 1.0026 1.0169 1.0092 1.0038 0.9917 0.9876 1.0025 1.0026 1.0010 1.0040 1.0037
dispcorr: -0.029297948 hartree
energy: -1513.539588356047
dipole: 23.00390 -22.52297 0.48093 -13.08316 14.14062 1.05746 -5.81809 4.50478 -1.31331
magnitude: 1.75337 au
magnitude: 4.45672 debye
