program: Orca
programVersion: 4.2.1
elementType: Cl O O N N N C C C C C C C C C C C C C C C C C C C H H H H H H H H H H H H H H H H H H H H H H H H
charge: 0
multiplicity: 1
keywords: wb97x-d3
keywords: def2-TZVPP
keywords: def2/J RIJCOSX GRIDX6 NOFINALGRIDX
keywords: grid4 nofinalgrid
keywords: scfconv7
keywords: smallprint printgap noloewdin
keywords: NOSOSCF
formula: C19H24ClN3O2
InChI: InChI=1S/C19H24ClN3O2/c1-18(2)13-25-19(3,23(18)17(24)22-12-11-21-14-22)10-4-5-15-6-8-16(20)9-7-15/h6-9,11-12,14H,4-5,10,13H2,1-3H3
49 atoms
Cl -6.018849 2.241688 -1.9443
O  2.955713 1.559475 0.128253
O  1.391954 -1.650794 2.213346
N  2.311316 -0.594564 0.427281
N  1.741668 -2.87183 0.335251
N  0.802427 -4.615589 -0.625023
C  2.501807 0.695274 1.148661
C  2.67664 -0.454457 -1.00557
C  2.545639 1.060793 -1.124155
C  1.217678 1.247259 1.780436
C  3.605374 0.589474 2.189114
C  4.12058 -0.872241 -1.267592
C  1.721907 -1.117405 -1.987726
C  -0.018755 1.307577 0.893375
C  1.807802 -1.648909 1.071039
C  -1.25559 1.711834 1.698491
C  -2.467144 1.84995 0.823227
C  2.766491 -3.71596 -0.013566
C  0.584098 -3.469939 -0.044774
C  -3.233372 0.73818 0.480815
C  -2.82376 3.084417 0.287141
C  2.162089 -4.782029 -0.604687
C  -4.324653 0.847762 -0.368081
C  -3.911989 3.216046 -0.563089
C  -4.654358 2.09119 -0.884083
H  3.196129 1.468534 -1.898241
H  1.515059 1.346859 -1.361212
H  1.461975 2.258353 2.119556
H  0.989835 0.678591 2.68121
H  3.330162 -0.087909 2.994462
H  3.791553 1.568351 2.632265
H  4.533692 0.234716 1.741155
H  4.271668 -1.939586 -1.124242
H  4.820774 -0.340277 -0.623309
H  4.381531 -0.644572 -2.301654
H  0.678319 -0.966034 -1.709123
H  1.866987 -0.653783 -2.964851
H  1.907883 -2.181585 -2.118383
H  0.121541 2.028155 0.084406
H  -0.211797 0.340337 0.41898
H  -1.06078 2.65735 2.210636
H  -1.437561 0.965101 2.475625
H  3.796505 -3.514867 0.224236
H  -0.380081 -3.013321 0.117005
H  -2.980836 -0.234969 0.884881
H  -2.24557 3.965613 0.537679
H  2.635067 -5.663777 -1.00594
H  -4.909674 -0.02639 -0.619708
H  -4.175016 4.184658 -0.966001
elementType: Cl O N C H
totalener: -1513.51139857 hartree
nucrepener: 2391.57735151 hartree
electener: -3905.08875008 hartree
oneelecener: -6819.84615338 hartree
twoeener: 2914.75740330 hartree
cpcmener: -0.03775149 hartree
kineticenergy: 1508.16548550 hartree
xcener: -124.309008069392 hartree
chargesum: 0.0000000
charge: -0.108284 -0.400425 -0.477965 -0.070480 -0.017587 -0.379392 0.367787 0.131888 0.027401 -0.262800 -0.312185 -0.336003 -0.331876 -0.128536 0.337168 -0.053094 0.022343 -0.151393 0.041966 -0.224848 -0.213439 -0.130709 -0.149384 -0.149157 0.086947 0.119117 0.089022 0.101121 0.091258 0.103356 0.113829 0.107846 0.113730 0.113051 0.110051 0.107906 0.126519 0.106894 0.101498 0.076880 0.088523 0.095426 0.195023 0.174578 0.145715 0.143337 0.167709 0.144784 0.144884
qa: -0.1083 -0.4004 -0.4780 -0.0705 -0.0176 -0.3794 0.3678 0.1319 0.0274 -0.2628 -0.3122 -0.3360 -0.3319 -0.1285 0.3372 -0.0531 0.0223 -0.1514 0.0420 -0.2248 -0.2134 -0.1307 -0.1494 -0.1492 0.0869 0.1191 0.0890 0.1011 0.0913 0.1034 0.1138 0.1078 0.1137 0.1131 0.1101 0.1079 0.1265 0.1069 0.1015 0.0769 0.0885 0.0954 0.1950 0.1746 0.1457 0.1433 0.1677 0.1448 0.1449
va: 1.1970 1.9620 2.0186 3.1447 3.2385 3.1122 3.9330 3.8839 3.9541 3.8545 3.9524 3.9571 3.9394 3.8724 4.2736 3.7844 3.5862 3.9166 4.0370 3.9729 3.9782 4.0349 3.9776 3.9687 3.8129 0.9950 0.9883 1.0185 1.0324 1.0130 1.0025 1.0039 1.0009 1.0045 1.0016 1.0004 1.0041 0.9966 1.0088 1.0138 1.0124 1.0079 0.9791 0.9984 1.0031 1.0031 1.0026 1.0049 1.0045
dispcorr: -0.028738687 hartree
energy: -1513.540137256550
dipole: 33.25368 -31.02282 2.23086 -0.53080 2.12078 1.58998 4.74588 -5.35339 -0.60751
magnitude: 2.80603 au
magnitude: 7.13237 debye
