program: Orca
programVersion: 4.2.1
elementType: Cl O O N N N C C C C C C C C C C C C C C C C C C C H H H H H H H H H H H H H H H H H H H H H H H H
charge: 0
multiplicity: 1
keywords: wb97x-d3
keywords: def2-TZVPP
keywords: def2/J RIJCOSX GRIDX6 NOFINALGRIDX
keywords: grid4 nofinalgrid
keywords: scfconv7
keywords: smallprint printgap noloewdin
keywords: NOSOSCF
formula: C19H24ClN3O2
InChI: InChI=1S/C19H24ClN3O2/c1-18(2)13-25-19(3,23(18)17(24)22-12-11-21-14-22)10-4-5-15-6-8-16(20)9-7-15/h6-9,11-12,14H,4-5,10,13H2,1-3H3
49 atoms
Cl -6.152269 2.014371 -1.946255
O  2.956653 1.546347 -0.234394
O  1.576604 -1.333432 2.393082
N  2.327223 -0.536463 0.406091
N  1.783179 -2.805151 0.677878
N  0.799203 -4.665512 0.03529
C  2.546244 0.844262 0.91986
C  2.631617 -0.61697 -1.044966
C  2.517259 0.866371 -1.386868
C  1.284752 1.479937 1.516133
C  3.69406 0.899308 1.916028
C  4.054814 -1.104544 -1.2982
C  1.626335 -1.397595 -1.879193
C  0.019527 1.427134 0.670201
C  1.892136 -1.490047 1.23007
C  -1.180491 1.971293 1.448462
C  -2.431574 1.98805 0.619073
C  2.787529 -3.716508 0.465577
C  0.610102 -3.434318 0.41771
C  -2.723859 3.070445 -0.207444
C  -3.311244 0.90879 0.624196
C  2.155205 -4.853777 0.06711
C  -3.860409 3.086713 -1.001914
C  -4.455379 0.905975 -0.161023
C  -4.720018 2.000188 -0.96831
H  3.158245 1.141263 -2.224811
H  1.486768 1.129081 -1.649771
H  1.537637 2.52585 1.713554
H  1.087823 1.033165 2.489893
H  4.596789 0.452879 1.499089
H  3.449866 0.384614 2.842084
H  3.911674 1.938302 2.16531
H  4.791926 -0.505581 -0.763101
H  4.278424 -1.034444 -2.363197
H  4.188509 -2.145026 -1.010443
H  1.792063 -2.472819 -1.861409
H  0.598554 -1.187037 -1.581788
H  1.733425 -1.082579 -2.918611
H  0.141444 2.016274 -0.241546
H  -0.202678 0.40273 0.355558
H  -0.955331 2.982943 1.795934
H  -1.336736 1.360433 2.340895
H  3.824204 -3.496036 0.654105
H  -0.342658 -2.937385 0.514912
H  -2.056539 3.923743 -0.231492
H  -3.110135 0.05346 1.258167
H  2.606505 -5.798776 -0.188871
H  -4.073315 3.940322 -1.631238
H  -5.130601 0.061479 -0.136621
elementType: Cl O N C H
totalener: -1513.51141057 hartree
nucrepener: 2387.24155183 hartree
electener: -3900.75296240 hartree
oneelecener: -6811.15341091 hartree
twoeener: 2910.40044851 hartree
cpcmener: -0.03780503 hartree
kineticenergy: 1508.16693195 hartree
xcener: -124.308807995136 hartree
chargesum: -0.0000000
charge: -0.108045 -0.400219 -0.477613 -0.066438 -0.019029 -0.379820 0.363245 0.134849 0.032473 -0.261029 -0.311052 -0.341532 -0.333777 -0.130789 0.341430 -0.053549 0.019945 -0.151698 0.038999 -0.218358 -0.215076 -0.132605 -0.149798 -0.151163 0.086956 0.117926 0.086408 0.100664 0.093091 0.107169 0.103226 0.114468 0.114526 0.110504 0.115173 0.103853 0.108135 0.127247 0.099286 0.080429 0.094045 0.090657 0.196530 0.175460 0.143642 0.143724 0.168452 0.144878 0.144200
qa: -0.1080 -0.4002 -0.4776 -0.0664 -0.0190 -0.3798 0.3632 0.1348 0.0325 -0.2610 -0.3111 -0.3415 -0.3338 -0.1308 0.3414 -0.0535 0.0199 -0.1517 0.0390 -0.2184 -0.2151 -0.1326 -0.1498 -0.1512 0.0870 0.1179 0.0864 0.1007 0.0931 0.1072 0.1032 0.1145 0.1145 0.1105 0.1152 0.1039 0.1081 0.1272 0.0993 0.0804 0.0940 0.0907 0.1965 0.1755 0.1436 0.1437 0.1685 0.1449 0.1442
va: 1.1974 1.9619 2.0218 3.1473 3.2400 3.1119 3.9370 3.8784 3.9473 3.8429 3.9487 3.9618 3.9435 3.8746 4.2706 3.7824 3.5827 3.9121 4.0384 3.9771 3.9716 4.0358 3.9730 3.9714 3.8121 0.9952 0.9889 1.0186 1.0328 1.0040 1.0141 1.0031 1.0034 1.0017 1.0013 0.9969 1.0000 1.0036 1.0093 1.0157 1.0093 1.0099 0.9775 0.9978 1.0027 1.0037 1.0020 1.0045 1.0046
dispcorr: -0.028641605 hartree
energy: -1513.540052170857
dipole: 33.48176 -31.32945 2.15231 -0.19002 1.68524 1.49523 3.10767 -4.06137 -0.95370
magnitude: 2.78885 au
magnitude: 7.08870 debye
