program: Orca
programVersion: 4.2.1
elementType: Cl O O N N N C C C C C C C C C C C C C C C C C C C H H H H H H H H H H H H H H H H H H H H H H H H
charge: 0
multiplicity: 1
keywords: wb97x-d3
keywords: def2-TZVPP
keywords: def2/J RIJCOSX GRIDX6 NOFINALGRIDX
keywords: grid4 nofinalgrid
keywords: scfconv7
keywords: smallprint printgap noloewdin
keywords: NOSOSCF
formula: C19H24ClN3O2
InChI: InChI=1S/C19H24ClN3O2/c1-18(2)13-25-19(3,23(18)17(24)22-12-11-21-14-22)10-4-5-15-6-8-16(20)9-7-15/h6-9,11-12,14H,4-5,10,13H2,1-3H3
49 atoms
Cl -6.051157 1.825062 -2.008353
O  3.015055 1.549017 -0.23345
O  1.513167 -1.269373 2.391686
N  2.324437 -0.512828 0.413065
N  1.688358 -2.756994 0.687013
N  0.639467 -4.578873 0.036803
C  2.583189 0.862635 0.922534
C  2.638804 -0.60852 -1.035098
C  2.562533 0.875238 -1.384612
C  1.340287 1.539304 1.51455
C  3.730803 0.884595 1.919993
C  4.052114 -1.131154 -1.271921
C  1.623211 -1.36742 -1.876441
C  0.069455 1.489657 0.677535
C  1.842393 -1.445009 1.235223
C  -1.123286 2.069722 1.440594
C  -2.376131 2.028343 0.614779
C  2.658801 -3.705043 0.480895
C  0.494239 -3.341904 0.419015
C  -2.761129 3.117204 -0.162253
C  -3.154294 0.874158 0.560777
C  1.987365 -4.817369 0.076291
C  -3.887896 3.065538 -0.970349
C  -4.283555 0.801057 -0.240647
C  -4.639993 1.902655 -1.002559
H  3.21275 1.130224 -2.221969
H  1.53959 1.162865 -1.651753
H  1.617653 2.583949 1.683531
H  1.14148 1.121074 2.500488
H  3.473666 0.368451 2.841924
H  3.972689 1.916139 2.17792
H  4.623386 0.419941 1.501106
H  4.798356 -0.543974 -0.736573
H  4.286361 -1.076373 -2.33555
H  4.160559 -2.171445 -0.972642
H  1.759229 -2.44653 -1.850691
H  0.59743 -1.126956 -1.594955
H  1.752328 -1.061908 -2.916182
H  0.196218 2.052165 -0.250177
H  -0.17007 0.461548 0.388436
H  -0.902651 3.099596 1.731704
H  -1.268773 1.505305 2.365304
H  3.701809 -3.522751 0.674049
H  -0.440677 -2.810664 0.508619
H  -2.17574 4.028369 -0.138774
H  -2.880312 0.01203 1.157231
H  2.404747 -5.778542 -0.176636
H  -4.172174 3.923792 -1.563878
H  -4.875909 -0.103448 -0.26654
elementType: Cl O N C H
totalener: -1513.51111916 hartree
nucrepener: 2395.20516618 hartree
electener: -3908.71628534 hartree
oneelecener: -6827.12012071 hartree
twoeener: 2918.40383537 hartree
cpcmener: -0.03740033 hartree
kineticenergy: 1508.16987274 hartree
xcener: -124.309400287491 hartree
chargesum: -0.0000000
charge: -0.108028 -0.399563 -0.474991 -0.065505 -0.015069 -0.379231 0.363353 0.134314 0.032156 -0.255161 -0.312426 -0.339143 -0.333432 -0.129354 0.329647 -0.056349 0.028898 -0.150296 0.041514 -0.214217 -0.226862 -0.132308 -0.147635 -0.148132 0.084853 0.118218 0.086287 0.101465 0.090470 0.102965 0.114609 0.107310 0.114341 0.110424 0.114990 0.104320 0.108358 0.127606 0.102571 0.070426 0.090255 0.095010 0.195719 0.172393 0.143124 0.144062 0.167949 0.144891 0.145200
qa: -0.1080 -0.3996 -0.4750 -0.0655 -0.0151 -0.3792 0.3634 0.1343 0.0322 -0.2552 -0.3124 -0.3391 -0.3334 -0.1294 0.3296 -0.0563 0.0289 -0.1503 0.0415 -0.2142 -0.2269 -0.1323 -0.1476 -0.1481 0.0849 0.1182 0.0863 0.1015 0.0905 0.1030 0.1146 0.1073 0.1143 0.1104 0.1150 0.1043 0.1084 0.1276 0.1026 0.0704 0.0903 0.0950 0.1957 0.1724 0.1431 0.1441 0.1679 0.1449 0.1452
va: 1.1974 1.9629 2.0230 3.1436 3.2358 3.1130 3.9353 3.8813 3.9508 3.8501 3.9515 3.9606 3.9427 3.8795 4.2782 3.7900 3.5778 3.9129 4.0389 3.9794 3.9721 4.0357 3.9680 3.9771 3.8154 0.9944 0.9888 1.0186 1.0332 1.0137 1.0025 1.0039 1.0036 1.0016 1.0011 0.9969 0.9992 1.0036 1.0094 1.0151 1.0121 1.0080 0.9781 0.9991 1.0034 1.0037 1.0023 1.0044 1.0044
dispcorr: -0.028814640 hartree
energy: -1513.539933802708
dipole: 33.52588 -31.28119 2.24470 0.48522 1.01272 1.49794 3.35009 -4.29177 -0.94167
magnitude: 2.85819 au
magnitude: 7.26493 debye
