program: Orca
programVersion: 4.2.1
elementType: Cl O O N N N C C C C C C C C C C C C C C C C C C C H H H H H H H H H H H H H H H H H H H H H H H H
charge: 0
multiplicity: 1
keywords: wb97x-d3
keywords: def2-TZVPP
keywords: def2/J RIJCOSX GRIDX6 NOFINALGRIDX
keywords: grid4 nofinalgrid
keywords: scfconv7
keywords: smallprint printgap noloewdin
keywords: NOSOSCF
formula: C19H24ClN3O2
InChI: InChI=1S/C19H24ClN3O2/c1-18(2)13-25-19(3,23(18)17(24)22-12-11-21-14-22)10-4-5-15-6-8-16(20)9-7-15/h6-9,11-12,14H,4-5,10,13H2,1-3H3
49 atoms
Cl -5.91365 1.655217 -2.123091
O  3.152419 1.528494 -0.127595
O  1.351468 -1.21438 2.382823
N  2.317833 -0.49758 0.459559
N  1.508776 -2.691943 0.667725
N  1.847912 -4.779295 0.060792
C  2.630406 0.855921 0.998718
C  2.670783 -0.589465 -0.981636
C  2.704689 0.902058 -1.306591
C  1.399946 1.595415 1.543129
C  3.730919 0.801568 2.045442
C  4.052193 -1.201529 -1.186789
C  1.631188 -1.260428 -1.86728
C  0.148145 1.568149 0.676055
C  1.727959 -1.400916 1.242218
C  -1.057026 2.175279 1.397218
C  -2.297165 2.073705 0.556762
C  0.271831 -3.216528 0.385382
C  2.417291 -3.679066 0.467674
C  -2.707832 3.124044 -0.258634
C  -3.033865 0.891339 0.526042
C  0.509507 -4.497289 -0.004525
C  -3.81794 3.006506 -1.083397
C  -4.145104 0.752352 -0.291174
C  -4.526529 1.816435 -1.09326
H  3.404539 1.125518 -2.112686
H  1.713966 1.259702 -1.610007
H  1.714306 2.63257 1.692553
H  1.162347 1.210871 2.534039
H  4.615289 0.295785 1.657367
H  3.405295 0.286112 2.946069
H  4.016237 1.814762 2.331748
H  4.818269 -0.676465 -0.615951
H  4.322718 -1.140973 -2.241482
H  4.08233 -2.252441 -0.907842
H  0.616859 -0.953182 -1.610599
H  1.813239 -0.944678 -2.89597
H  1.685882 -2.346575 -1.860108
H  0.310086 2.116323 -0.254767
H  -0.10607 0.54276 0.390923
H  -0.85211 3.220374 1.641174
H  -1.209856 1.653409 2.345689
H  -0.634819 -2.640369 0.463352
H  3.466208 -3.54903 0.679097
H  -2.156013 4.056145 -0.254701
H  -2.740455 0.057772 1.153296
H  -0.213721 -5.228881 -0.326721
H  -4.12191 3.835546 -1.707774
H  -4.703231 -0.173973 -0.298201
elementType: Cl O N C H
totalener: -1513.51072461 hartree
nucrepener: 2405.07117453 hartree
electener: -3918.58189914 hartree
oneelecener: -6846.74528869 hartree
twoeener: 2928.16338955 hartree
cpcmener: -0.03702139 hartree
kineticenergy: 1508.16268056 hartree
xcener: -124.307964445509 hartree
chargesum: 0.0000000
charge: -0.108080 -0.397280 -0.475591 -0.061210 -0.010101 -0.379460 0.357354 0.119694 0.036288 -0.252249 -0.309667 -0.332913 -0.327648 -0.124471 0.324640 -0.060081 0.035129 -0.135284 0.021647 -0.213091 -0.232540 -0.129428 -0.146696 -0.145655 0.083798 0.117951 0.086071 0.101551 0.089691 0.106658 0.102594 0.113550 0.114029 0.110135 0.113780 0.109047 0.127394 0.104663 0.106738 0.058975 0.090203 0.095811 0.183123 0.184072 0.143489 0.143810 0.168879 0.144819 0.145864
qa: -0.1081 -0.3973 -0.4756 -0.0612 -0.0101 -0.3795 0.3574 0.1197 0.0363 -0.2522 -0.3097 -0.3329 -0.3276 -0.1245 0.3246 -0.0601 0.0351 -0.1353 0.0216 -0.2131 -0.2325 -0.1294 -0.1467 -0.1457 0.0838 0.1180 0.0861 0.1016 0.0897 0.1067 0.1026 0.1136 0.1140 0.1101 0.1138 0.1090 0.1274 0.1047 0.1067 0.0590 0.0902 0.0958 0.1831 0.1841 0.1435 0.1438 0.1689 0.1448 0.1459
va: 1.1974 1.9631 2.0206 3.1378 3.2384 3.1082 3.9391 3.9050 3.9475 3.8614 3.9525 3.9562 3.9360 3.8825 4.2756 3.7986 3.5790 3.9013 4.0493 3.9804 3.9699 4.0220 3.9671 3.9769 3.8177 0.9937 0.9892 1.0193 1.0313 1.0045 1.0134 1.0023 1.0035 1.0013 1.0007 0.9990 1.0033 0.9978 1.0082 1.0141 1.0128 1.0078 0.9907 0.9874 1.0035 1.0040 1.0010 1.0044 1.0041
dispcorr: -0.029077220 hartree
energy: -1513.539801826489
dipole: 31.27405 -30.09908 1.17497 1.62331 0.14834 1.77165 3.96912 -4.94004 -0.97092
magnitude: 2.33709 au
magnitude: 5.94040 debye
