program: Orca
programVersion: 4.2.1
elementType: Cl O O N N N C C C C C C C C C C C C C C C C C C C H H H H H H H H H H H H H H H H H H H H H H H H
charge: 0
multiplicity: 1
keywords: wb97x-d3
keywords: def2-TZVPP
keywords: def2/J RIJCOSX GRIDX6 NOFINALGRIDX
keywords: grid4 nofinalgrid
keywords: scfconv7
keywords: smallprint printgap noloewdin
keywords: NOSOSCF
formula: C19H24ClN3O2
InChI: InChI=1S/C19H24ClN3O2/c1-18(2)13-25-19(3,23(18)17(24)22-12-11-21-14-22)10-4-5-15-6-8-16(20)9-7-15/h6-9,11-12,14H,4-5,10,13H2,1-3H3
49 atoms
Cl -5.898554 2.520256 -2.211911
O  2.879529 1.432139 0.879806
O  1.966547 -2.145734 -1.570733
N  2.632704 -0.610142 -0.038874
N  1.425169 -2.524886 0.597926
N  -0.158473 -3.662094 1.620776
C  2.479668 0.133447 1.253347
C  3.36718 0.217088 -1.028775
C  3.888562 1.305546 -0.095522
C  1.045574 0.232387 1.767345
C  3.410628 -0.38965 2.342449
C  4.522795 -0.523625 -1.682956
C  2.433981 0.827903 -2.072053
C  0.015406 0.712189 0.755474
C  2.031177 -1.736389 -0.428618
C  -1.382035 0.713631 1.355862
C  -2.482802 1.175292 0.435605
C  2.048478 -3.255614 1.579929
C  0.101394 -2.82519 0.657482
C  -3.793673 1.218739 0.913181
C  -2.259871 1.56234 -0.881814
C  1.052193 -3.946559 2.195834
C  -4.846336 1.628993 0.113286
C  -3.302579 1.977025 -1.701705
C  -4.589363 2.006546 -1.196788
H  4.850992 1.025006 0.349812
H  4.014645 2.262216 -0.601552
H  1.075672 0.930768 2.60877
H  0.741619 -0.720412 2.203062
H  3.055225 -1.321868 2.772857
H  3.453068 0.34077 3.150894
H  4.424812 -0.552685 1.978046
H  4.190553 -1.238763 -2.431654
H  5.129629 -1.048486 -0.944258
H  5.167216 0.199876 -2.185013
H  1.641286 1.415702 -1.607851
H  3.006514 1.497445 -2.715511
H  1.975237 0.074235 -2.707093
H  0.274565 1.717962 0.418008
H  0.02209 0.079103 -0.136845
H  -1.390286 1.342261 2.251546
H  -1.625106 -0.294747 1.707859
H  3.115987 -3.254275 1.716563
H  -0.618573 -2.399056 -0.023625
H  -3.999988 0.924173 1.935223
H  -1.26251 1.549626 -1.30094
H  1.145457 -4.637483 3.017873
H  -5.853078 1.652951 0.5076
H  -3.102291 2.272209 -2.722634
elementType: Cl O N C H
totalener: -1513.51125033 hartree
nucrepener: 2412.52899325 hartree
electener: -3926.04024358 hartree
oneelecener: -6861.88231617 hartree
twoeener: 2935.84207259 hartree
cpcmener: -0.03715343 hartree
kineticenergy: 1508.15881904 hartree
xcener: -124.310211037336 hartree
chargesum: 0.0000000
charge: -0.108626 -0.389283 -0.473659 -0.051040 -0.012990 -0.378746 0.258128 0.132446 0.072112 -0.189861 -0.311077 -0.322261 -0.360064 -0.111772 0.338224 -0.099908 0.041042 -0.154187 0.027875 -0.217193 -0.184614 -0.123313 -0.171646 -0.193677 0.117500 0.086180 0.115157 0.113245 0.090532 0.117893 0.112582 0.111253 0.106375 0.101490 0.115769 0.106587 0.115237 0.114378 0.097843 0.059611 0.101369 0.093430 0.197307 0.171396 0.141198 0.142760 0.168745 0.143990 0.142266
qa: -0.1086 -0.3893 -0.4737 -0.0510 -0.0130 -0.3787 0.2581 0.1324 0.0721 -0.1899 -0.3111 -0.3223 -0.3601 -0.1118 0.3382 -0.0999 0.0410 -0.1542 0.0279 -0.2172 -0.1846 -0.1233 -0.1716 -0.1937 0.1175 0.0862 0.1152 0.1132 0.0905 0.1179 0.1126 0.1113 0.1064 0.1015 0.1158 0.1066 0.1152 0.1144 0.0978 0.0596 0.1014 0.0934 0.1973 0.1714 0.1412 0.1428 0.1687 0.1440 0.1423
va: 1.1967 1.9592 2.0285 3.1510 3.2407 3.0987 4.0606 3.9093 3.8935 3.7480 3.9525 3.9168 3.9235 3.8803 4.2593 3.8233 3.6432 3.9100 4.0338 4.0188 3.9216 4.0335 3.9876 4.0623 3.7852 1.0036 0.9933 1.0214 1.0097 0.9991 1.0102 1.0043 1.0151 1.0042 0.9989 0.9998 1.0031 1.0176 1.0166 1.0020 1.0016 1.0050 0.9781 0.9973 1.0034 1.0028 1.0011 1.0053 1.0082
dispcorr: -0.029628112 hartree
energy: -1513.540878441628
dipole: 35.76267 -32.76268 2.99999 -1.54927 3.00789 1.45862 9.77672 -8.54096 1.23575
magnitude: 3.55733 au
magnitude: 9.04201 debye
