program: Orca
programVersion: 4.2.1
elementType: Cl O O N N N C C C C C C C C C C C C C C C C C C C H H H H H H H H H H H H H H H H H H H H H H H H
charge: 0
multiplicity: 1
keywords: wb97x-d3
keywords: def2-TZVPP
keywords: def2/J RIJCOSX GRIDX6 NOFINALGRIDX
keywords: grid4 nofinalgrid
keywords: scfconv7
keywords: smallprint printgap noloewdin
keywords: NOSOSCF
formula: C19H24ClN3O2
InChI: InChI=1S/C19H24ClN3O2/c1-18(2)13-25-19(3,23(18)17(24)22-12-11-21-14-22)10-4-5-15-6-8-16(20)9-7-15/h6-9,11-12,14H,4-5,10,13H2,1-3H3
49 atoms
Cl -5.316502 -0.920064 0.059149
O  3.108916 1.575383 0.62018
O  2.286042 -1.981692 -1.886327
N  2.583293 -0.438532 -0.247752
N  0.605701 -1.696927 -0.390033
N  -0.933032 -2.617844 0.886962
C  2.056654 0.639126 0.656353
C  4.003086 -0.177759 -0.588355
C  4.315373 0.860897 0.483553
C  0.815256 1.314584 0.083155
C  1.852315 0.155224 2.090579
C  4.888931 -1.401549 -0.419539
C  4.156795 0.440979 -1.976324
C  0.364772 2.550714 0.853044
C  1.894648 -1.37244 -0.910251
C  -0.896902 3.165681 0.238207
C  -2.042457 2.193529 0.181957
C  -0.573926 -1.62656 -1.093424
C  0.329636 -2.315069 0.788345
C  -2.487039 1.66962 -1.027629
C  -2.649407 1.745696 1.353924
C  -1.50914 -2.174734 -0.274946
C  -3.500964 0.723591 -1.077931
C  -3.659134 0.797111 1.326537
C  -4.074113 0.292031 0.104523
H  4.616141 0.386919 1.426808
H  5.103933 1.549372 0.180903
H  -0.009753 0.603563 0.079338
H  1.008592 1.580198 -0.961125
H  1.864731 1.010144 2.766517
H  2.637343 -0.530556 2.409109
H  0.893811 -0.342073 2.223531
H  4.71186 -1.893468 0.537857
H  5.933737 -1.08667 -0.439937
H  4.754124 -2.130755 -1.215188
H  5.201225 0.71196 -2.136807
H  3.870424 -0.24887 -2.76629
H  3.558512 1.347206 -2.078279
H  0.160027 2.292555 1.895192
H  1.14917 3.309217 0.866662
H  -0.672606 3.526099 -0.768412
H  -1.179559 4.041231 0.827568
H  -0.638638 -1.168025 -2.065393
H  1.096833 -2.559321 1.505428
H  -2.030693 1.995954 -1.954187
H  -2.327281 2.135956 2.312143
H  -2.566113 -2.274577 -0.458779
H  -3.826237 0.323445 -2.028562
H  -4.113963 0.458331 2.24742
elementType: Cl O N C H
totalener: -1513.51025306 hartree
nucrepener: 2504.22376325 hartree
electener: -4017.73401631 hartree
oneelecener: -7045.73525915 hartree
twoeener: 3028.00124284 hartree
cpcmener: -0.03717961 hartree
kineticenergy: 1508.16874381 hartree
xcener: -124.311058740798 hartree
chargesum: -0.0000000
charge: -0.114585 -0.379233 -0.485321 -0.047111 -0.040818 -0.384414 0.236662 0.135768 0.075103 -0.139011 -0.351591 -0.315888 -0.353319 -0.157254 0.392268 -0.096731 0.046065 -0.143027 0.028052 -0.173457 -0.217198 -0.090542 -0.174926 -0.144962 0.107313 0.084429 0.113623 0.039190 0.112813 0.114883 0.116871 0.119603 0.101333 0.113535 0.105133 0.108421 0.105836 0.107252 0.088023 0.085122 0.087907 0.104747 0.184311 0.183537 0.138819 0.140521 0.146026 0.142648 0.143575
qa: -0.1146 -0.3792 -0.4853 -0.0471 -0.0408 -0.3844 0.2367 0.1358 0.0751 -0.1390 -0.3516 -0.3159 -0.3533 -0.1573 0.3923 -0.0967 0.0461 -0.1430 0.0281 -0.1735 -0.2172 -0.0905 -0.1749 -0.1450 0.1073 0.0844 0.1136 0.0392 0.1128 0.1149 0.1169 0.1196 0.1013 0.1135 0.1051 0.1084 0.1058 0.1073 0.0880 0.0851 0.0879 0.1047 0.1843 0.1835 0.1388 0.1405 0.1460 0.1426 0.1436
va: 1.1885 1.9580 2.0178 3.1260 3.2681 3.0982 4.0814 3.9304 3.9045 3.8073 3.9535 3.9101 3.9276 3.8919 4.2345 3.8322 3.5549 3.9023 4.0312 3.8969 3.9753 4.0012 3.9509 3.9786 3.7482 1.0026 0.9927 1.0443 1.0101 1.0083 1.0042 0.9981 1.0052 0.9995 1.0151 1.0017 1.0193 1.0067 1.0017 1.0344 1.0109 1.0044 0.9962 0.9881 1.0029 1.0029 1.0160 1.0045 1.0042
dispcorr: -0.032289532 hartree
energy: -1513.542542594853
dipole: 34.71808 -32.39821 2.31987 13.59324 -11.16940 2.42384 2.32044 -1.71633 0.60411
magnitude: 3.40907 au
magnitude: 8.66516 debye
