program: Orca
programVersion: 4.2.1
elementType: Cl O O N N N C C C C C C C C C C C C C C C C C C C H H H H H H H H H H H H H H H H H H H H H H H H
charge: 0
multiplicity: 1
keywords: wb97x-d3
keywords: def2-TZVPP
keywords: def2/J RIJCOSX GRIDX6 NOFINALGRIDX
keywords: grid4 nofinalgrid
keywords: scfconv7
keywords: smallprint printgap noloewdin
keywords: NOSOSCF
formula: C19H24ClN3O2
InChI: InChI=1S/C19H24ClN3O2/c1-18(2)13-25-19(3,23(18)17(24)22-12-11-21-14-22)10-4-5-15-6-8-16(20)9-7-15/h6-9,11-12,14H,4-5,10,13H2,1-3H3
49 atoms
Cl -6.369688 4.829591 0.4573
O  1.82827 1.037509 -0.047361
O  1.341447 -2.828046 1.345056
N  2.293902 -1.167621 0.122157
N  3.079951 -3.372542 -0.004842
N  4.589318 -4.974787 -0.021473
C  1.302373 -0.130244 0.540772
C  3.454953 -0.530386 -0.557078
C  3.229151 0.901723 -0.07618
C  -0.06443 -0.396581 -0.083957
C  1.246919 0.039423 2.057004
C  4.821053 -1.015237 -0.093617
C  3.339719 -0.588595 -2.076979
C  -1.090262 0.702968 0.170265
C  2.165949 -2.425696 0.547404
C  -2.405512 0.412124 -0.554643
C  -3.418558 1.495424 -0.321549
C  3.124338 -3.845325 -1.293383
C  3.969091 -4.099892 0.717971
C  -3.468024 2.615495 -1.147759
C  -4.299893 1.434022 0.754749
C  4.058991 -4.833374 -1.277024
C  -4.368909 3.644543 -0.917172
C  -5.208781 2.452205 1.003369
C  -5.234443 3.552004 0.16103
H  3.674118 1.061153 0.914602
H  3.645949 1.640821 -0.759967
H  -0.455116 -1.341105 0.297747
H  0.071854 -0.522718 -1.162098
H  2.243901 0.092222 2.494945
H  0.70917 -0.769102 2.542334
H  0.734272 0.97065 2.296227
H  5.13509 -1.937665 -0.578391
H  4.866668 -1.147993 0.987595
H  5.55865 -0.256141 -0.359997
H  3.490183 -1.595092 -2.460201
H  2.371458 -0.230709 -2.426963
H  4.111082 0.041238 -2.521869
H  -1.292946 0.796817 1.240161
H  -0.706129 1.670262 -0.162439
H  -2.802797 -0.547154 -0.213237
H  -2.21401 0.309957 -1.625854
H  2.470297 -3.48564 -2.068377
H  4.13185 -3.925314 1.769927
H  -2.794819 2.689845 -1.993306
H  -4.284364 0.5747 1.414262
H  4.371553 -5.45329 -2.101542
H  -4.394624 4.503737 -1.573585
H  -5.887838 2.383663 1.842328
elementType: Cl O N C H
totalener: -1513.51285396 hartree
nucrepener: 2303.48544309 hartree
electener: -3816.99829705 hartree
oneelecener: -6643.75023888 hartree
twoeener: 2826.75194183 hartree
cpcmener: -0.03845932 hartree
kineticenergy: 1508.16191441 hartree
xcener: -124.306311813719 hartree
chargesum: -0.0000000
charge: -0.108032 -0.389212 -0.487761 -0.062367 -0.031523 -0.381746 0.322281 0.121613 0.068576 -0.233029 -0.344689 -0.334053 -0.344336 -0.124173 0.382159 -0.040842 0.019943 -0.152451 0.035895 -0.220407 -0.218267 -0.131170 -0.145837 -0.147276 0.083343 0.087614 0.113131 0.100596 0.089431 0.108294 0.116027 0.107064 0.099632 0.112301 0.123259 0.113430 0.111959 0.110053 0.084127 0.083855 0.091774 0.091297 0.194343 0.179798 0.143363 0.143488 0.169093 0.144692 0.144741
qa: -0.1080 -0.3892 -0.4878 -0.0624 -0.0315 -0.3817 0.3223 0.1216 0.0686 -0.2330 -0.3447 -0.3341 -0.3443 -0.1242 0.3822 -0.0408 0.0199 -0.1525 0.0359 -0.2204 -0.2183 -0.1312 -0.1458 -0.1473 0.0833 0.0876 0.1131 0.1006 0.0894 0.1083 0.1160 0.1071 0.0996 0.1123 0.1233 0.1134 0.1120 0.1101 0.0841 0.0839 0.0918 0.0913 0.1943 0.1798 0.1434 0.1435 0.1691 0.1447 0.1447
va: 1.1976 1.9541 2.0171 3.1646 3.2567 3.1107 3.9940 3.9027 3.9127 3.8717 3.9476 3.9453 3.9472 3.8085 4.2452 3.7508 3.5972 3.9180 4.0390 3.9769 3.9770 4.0425 3.9661 3.9669 3.8144 1.0031 0.9920 1.0273 1.0170 1.0045 1.0180 1.0048 0.9963 1.0008 1.0039 1.0017 1.0073 1.0024 1.0124 1.0344 1.0093 1.0102 0.9788 0.9964 1.0031 1.0033 1.0020 1.0044 1.0043
dispcorr: -0.027056389 hartree
energy: -1513.539910344705
dipole: 29.92553 -28.76095 1.16458 -10.60861 12.05506 1.44645 -4.81650 3.67831 -1.13819
magnitude: 2.17806 au
magnitude: 5.53619 debye
