program: Orca
programVersion: 4.2.1
elementType: Cl O O N N N C C C C C C C C C C C C C C C C C C C H H H H H H H H H H H H H H H H H H H H H H H H
charge: 0
multiplicity: 1
keywords: wb97x-d3
keywords: def2-TZVPP
keywords: def2/J RIJCOSX GRIDX6 NOFINALGRIDX
keywords: grid4 nofinalgrid
keywords: scfconv7
keywords: smallprint printgap noloewdin
keywords: NOSOSCF
formula: C19H24ClN3O2
InChI: InChI=1S/C19H24ClN3O2/c1-18(2)13-25-19(3,23(18)17(24)22-12-11-21-14-22)10-4-5-15-6-8-16(20)9-7-15/h6-9,11-12,14H,4-5,10,13H2,1-3H3
49 atoms
Cl -5.209319 -0.895401 -0.444191
O  3.136081 1.547478 0.672979
O  2.06585 -1.905958 -1.891635
N  2.531284 -0.436484 -0.223049
N  0.564047 -1.721932 -0.202326
N  -0.813216 -2.709831 1.202375
C  2.082054 0.61515 0.752566
C  3.89936 -0.136248 -0.709824
C  4.320332 0.844033 0.378331
C  0.810937 1.311587 0.280051
C  1.975759 0.096722 2.183945
C  4.812278 -1.352245 -0.713729
C  3.887802 0.559054 -2.069428
C  0.357494 2.470618 1.159546
C  1.783038 -1.352192 -0.847435
C  -0.879918 3.16353 0.577097
C  -2.006831 2.20247 0.317856
C  -0.685715 -1.653794 -0.773479
C  0.426291 -2.379896 0.97889
C  -2.681357 1.594326 1.374831
C  -2.360368 1.842716 -0.97878
C  -1.517991 -2.245613 0.121839
C  -3.66844 0.647828 1.150783
C  -3.350357 0.901695 -1.225712
C  -3.992704 0.309519 -0.153414
H  4.710266 0.319908 1.259818
H  5.077542 1.549537 0.038442
H  -0.001518 0.587806 0.243815
H  0.968529 1.660118 -0.745878
H  2.782268 -0.592428 2.43298
H  1.030188 -0.40518 2.37547
H  2.034358 0.937092 2.874981
H  4.590958 -2.039327 -1.527176
H  4.755127 -1.898373 0.228032
H  5.843837 -1.018939 -0.839776
H  3.278699 1.463561 -2.054616
H  4.90519 0.84885 -2.335639
H  3.51409 -0.090757 -2.857471
H  0.120979 2.108472 2.163217
H  1.149765 3.212904 1.273126
H  -0.608821 3.66582 -0.354204
H  -1.203492 3.942878 1.270938
H  -0.862045 -1.172824 -1.720592
H  1.269882 -2.625224 1.603945
H  -2.431342 1.854061 2.396807
H  -1.850658 2.297807 -1.819387
H  -2.586704 -2.363776 0.046817
H  -4.176385 0.181725 1.984169
H  -3.606227 0.6340 -2.241956
elementType: Cl O N C H
totalener: -1513.51019518 hartree
nucrepener: 2509.86364544 hartree
electener: -4023.37384061 hartree
oneelecener: -7056.95055134 hartree
twoeener: 3033.57671073 hartree
cpcmener: -0.03631944 hartree
kineticenergy: 1508.16725814 hartree
xcener: -124.311214265765 hartree
chargesum: 0.0000000
charge: -0.114940 -0.382872 -0.483120 -0.060358 -0.035709 -0.384724 0.245910 0.147584 0.067809 -0.126931 -0.355003 -0.316371 -0.354292 -0.155433 0.390183 -0.103027 0.032799 -0.135803 0.030896 -0.189780 -0.156955 -0.104951 -0.150521 -0.187642 0.103528 0.084740 0.113282 0.027121 0.112462 0.116753 0.122443 0.113866 0.105712 0.101465 0.113418 0.106392 0.108998 0.106013 0.087009 0.086459 0.088482 0.103763 0.184438 0.184086 0.139806 0.138466 0.148698 0.142167 0.143683
qa: -0.1149 -0.3829 -0.4831 -0.0604 -0.0357 -0.3847 0.2459 0.1476 0.0678 -0.1269 -0.3550 -0.3164 -0.3543 -0.1554 0.3902 -0.1030 0.0328 -0.1358 0.0309 -0.1898 -0.1570 -0.1050 -0.1505 -0.1876 0.1035 0.0847 0.1133 0.0271 0.1125 0.1168 0.1224 0.1139 0.1057 0.1015 0.1134 0.1064 0.1090 0.1060 0.0870 0.0865 0.0885 0.1038 0.1844 0.1841 0.1398 0.1385 0.1487 0.1422 0.1437
va: 1.1871 1.9545 2.0196 3.1277 3.2700 3.0992 4.0925 3.9203 3.9198 3.7968 3.9566 3.9061 3.9290 3.8827 4.2381 3.8406 3.5746 3.9009 4.0289 3.9425 3.8974 4.0056 3.9480 3.9845 3.7405 1.0023 0.9929 1.0537 1.0098 1.0050 0.9961 1.0085 1.0149 1.0060 0.9996 1.0072 1.0015 1.0189 1.0011 1.0338 1.0102 1.0049 0.9960 0.9875 1.0023 1.0028 1.0204 1.0051 1.0051
dispcorr: -0.032436145 hartree
energy: -1513.542631320035
dipole: 34.12777 -31.81525 2.31253 13.60512 -11.20563 2.39948 3.98938 -3.35157 0.63781
magnitude: 3.39295 au
magnitude: 8.62419 debye
