program: Orca
programVersion: 4.2.1
elementType: Cl O O N N N C C C C C C C C C C C C C C C C C C C H H H H H H H H H H H H H H H H H H H H H H H H
charge: 0
multiplicity: 1
keywords: wb97x-d3
keywords: def2-TZVPP
keywords: def2/J RIJCOSX GRIDX6 NOFINALGRIDX
keywords: grid4 nofinalgrid
keywords: scfconv7
keywords: smallprint printgap noloewdin
keywords: NOSOSCF
formula: C19H24ClN3O2
InChI: InChI=1S/C19H24ClN3O2/c1-18(2)13-25-19(3,23(18)17(24)22-12-11-21-14-22)10-4-5-15-6-8-16(20)9-7-15/h6-9,11-12,14H,4-5,10,13H2,1-3H3
49 atoms
Cl -6.370785 3.938891 1.059357
O  2.066612 0.966798 0.799772
O  4.434829 -2.463491 -0.673895
N  2.902316 -0.849912 -0.23102
N  2.324583 -3.124547 -0.160789
N  0.704239 -4.545448 -0.61005
C  1.671816 -0.340894 0.456952
C  3.827187 0.272125 -0.528454
C  2.89369 1.4444 -0.235844
C  0.473447 -0.303018 -0.501215
C  1.354715 -1.056389 1.759067
C  5.011774 0.304543 0.435256
C  4.282701 0.296384 -1.978727
C  -0.696518 0.52905 0.00904
C  3.312313 -2.111717 -0.369577
C  -1.858501 0.51809 -0.985841
C  -3.004801 1.361111 -0.507475
C  2.374564 -4.087954 0.81666
C  1.313075 -3.4625 -1.001895
C  -4.040688 0.807795 0.240185
C  -3.032282 2.731469 -0.755364
C  1.353789 -4.938734 0.530898
C  -5.078493 1.590061 0.726187
C  -4.05983 3.531406 -0.278684
C  -5.077398 2.949804 0.460961
H  3.429598 2.324883 0.1167
H  2.313028 1.731294 -1.121015
H  0.124358 -1.321595 -0.673353
H  0.789153 0.07734 -1.477191
H  0.834736 -1.998559 1.604631
H  0.698273 -0.42696 2.359657
H  2.257705 -1.240844 2.341198
H  5.599097 1.204941 0.250751
H  5.670972 -0.549993 0.307253
H  4.679371 0.331266 1.473779
H  4.734252 1.266331 -2.193793
H  5.027785 -0.465757 -2.194653
H  3.442303 0.165752 -2.66128
H  -1.051554 0.145583 0.969476
H  -0.3842 1.561513 0.180356
H  -2.193917 -0.509976 -1.142975
H  -1.507715 0.885677 -1.953661
H  3.094711 -4.062284 1.616702
H  1.099557 -2.906496 -1.900706
H  -4.045408 -0.255398 0.44796
H  -2.239581 3.188856 -1.335205
H  1.051023 -5.811488 1.08634
H  -5.876197 1.140399 1.301581
H  -4.064573 4.593016 -0.485155
elementType: Cl O N C H
totalener: -1513.51188791 hartree
nucrepener: 2335.19057312 hartree
electener: -3848.70246103 hartree
oneelecener: -6706.89721154 hartree
twoeener: 2858.19475050 hartree
cpcmener: -0.03862696 hartree
kineticenergy: 1508.16734308 hartree
xcener: -124.306214598099 hartree
chargesum: -0.0000000
charge: -0.108237 -0.395093 -0.483742 -0.060740 -0.036014 -0.384815 0.347097 0.131064 0.056854 -0.275075 -0.336648 -0.346209 -0.320333 -0.152481 0.389627 -0.038651 0.018148 -0.154441 0.025478 -0.213825 -0.223492 -0.117123 -0.147945 -0.146463 0.083955 0.118878 0.088795 0.113099 0.099755 0.107600 0.117026 0.121444 0.106990 0.106874 0.107114 0.113648 0.106687 0.101616 0.090782 0.086486 0.089411 0.092506 0.188600 0.184704 0.142796 0.144886 0.169088 0.145140 0.145177
qa: -0.1082 -0.3951 -0.4837 -0.0607 -0.0360 -0.3848 0.3471 0.1311 0.0569 -0.2751 -0.3366 -0.3462 -0.3203 -0.1525 0.3896 -0.0387 0.0181 -0.1544 0.0255 -0.2138 -0.2235 -0.1171 -0.1479 -0.1465 0.0840 0.1189 0.0888 0.1131 0.0998 0.1076 0.1170 0.1214 0.1070 0.1069 0.1071 0.1136 0.1067 0.1016 0.0908 0.0865 0.0894 0.0925 0.1886 0.1847 0.1428 0.1449 0.1691 0.1451 0.1452
va: 1.1974 1.9454 2.0213 3.1560 3.2707 3.0965 3.9465 3.9291 3.9120 3.9411 3.9623 3.9274 3.9196 3.8425 4.2301 3.7485 3.6002 3.9157 4.0332 3.9758 3.9772 4.0118 3.9665 3.9678 3.8142 0.9925 1.0001 1.0137 1.0110 0.9910 1.0086 1.0030 1.0018 1.0200 1.0067 0.9999 1.0148 1.0038 1.0120 1.0317 1.0107 1.0098 0.9915 0.9869 1.0038 1.0024 0.9998 1.0042 1.0042
dispcorr: -0.027548197 hartree
energy: -1513.539436108600
dipole: 30.87730 -30.02713 0.85017 -5.98691 7.66651 1.67960 -4.43001 4.36868 -0.06134
magnitude: 1.88351 au
magnitude: 4.78750 debye
