program: Orca
programVersion: 4.2.1
elementType: Cl O O N N N C C C C C C C C C C C C C C C C C C C H H H H H H H H H H H H H H H H H H H H H H H H
charge: 0
multiplicity: 1
keywords: wb97x-d3
keywords: def2-TZVPP
keywords: def2/J RIJCOSX GRIDX6 NOFINALGRIDX
keywords: grid4 nofinalgrid
keywords: scfconv7
keywords: smallprint printgap noloewdin
keywords: NOSOSCF
formula: C19H24ClN3O2
InChI: InChI=1S/C19H24ClN3O2/c1-18(2)13-25-19(3,23(18)17(24)22-12-11-21-14-22)10-4-5-15-6-8-16(20)9-7-15/h6-9,11-12,14H,4-5,10,13H2,1-3H3
49 atoms
Cl -4.885209 1.532759 -2.523016
O  2.040269 1.537367 -0.239909
O  1.772132 -1.630285 2.416015
N  1.89495 -0.636353 0.376678
N  1.704663 -2.963402 0.58257
N  2.231745 -5.053395 0.139622
C  1.824736 0.756518 0.913975
C  2.222738 -0.615408 -1.074033
C  2.824106 0.786151 -1.134942
C  0.417313 1.051125 1.425277
C  2.91797 1.050661 1.93626
C  3.259723 -1.635419 -1.519029
C  0.976484 -0.679466 -1.952672
C  0.168341 2.507146 1.798097
C  1.796121 -1.679718 1.201168
C  -1.299785 2.756211 2.160811
C  -2.231921 2.467587 1.017348
C  0.655472 -3.47914 -0.137879
C  2.615899 -3.957644 0.730956
C  -3.033441 1.330106 1.003686
C  -2.27517 3.312831 -0.089848
C  1.004988 -4.76749 -0.399611
C  -3.852719 1.03368 -0.077145
C  -3.08626 3.036149 -1.179207
C  -3.86937 1.892087 -1.162929
H  3.881337 0.773631 -0.842441
H  2.749169 1.226033 -2.128603
H  0.210373 0.420756 2.292284
H  -0.285034 0.751682 0.642975
H  3.897133 0.720857 1.585478
H  2.724865 0.579635 2.896052
H  2.971818 2.127401 2.09959
H  4.086451 -1.716896 -0.813353
H  3.67498 -1.299381 -2.47083
H  2.842532 -2.625174 -1.694535
H  1.259056 -0.507921 -2.991882
H  0.491641 -1.651842 -1.909194
H  0.24298 0.078607 -1.677923
H  0.785011 2.794421 2.652781
H  0.44789 3.16747 0.973667
H  -1.41099 3.797172 2.472718
H  -1.571778 2.141292 3.022025
H  -0.239295 -2.918454 -0.345881
H  3.543375 -3.810374 1.262331
H  -3.020892 0.652818 1.849093
H  -1.664507 4.207804 -0.109546
H  0.431069 -5.504663 -0.937872
H  -4.465025 0.142153 -0.067268
H  -3.105227 3.705967 -2.028242
elementType: Cl O N C H
totalener: -1513.51136975 hartree
nucrepener: 2422.68059928 hartree
electener: -3936.19196903 hartree
oneelecener: -6882.24278336 hartree
twoeener: 2946.05081434 hartree
cpcmener: -0.03729264 hartree
kineticenergy: 1508.16090066 hartree
xcener: -124.308216449544 hartree
chargesum: 0.0000000
charge: -0.108853 -0.387776 -0.489253 -0.066975 -0.032934 -0.381403 0.312632 0.129330 0.064086 -0.211998 -0.331812 -0.335335 -0.349390 -0.125993 0.381345 -0.090222 0.012552 -0.150146 0.036143 -0.178060 -0.212705 -0.131684 -0.151325 -0.155586 0.094878 0.086706 0.111897 0.103108 0.073872 0.108303 0.113141 0.108066 0.112912 0.123252 0.100746 0.113091 0.113158 0.109523 0.087385 0.084965 0.104725 0.088945 0.192910 0.180403 0.141881 0.142869 0.169013 0.145067 0.144547
qa: -0.1089 -0.3878 -0.4893 -0.0670 -0.0329 -0.3814 0.3126 0.1293 0.0641 -0.2120 -0.3318 -0.3353 -0.3494 -0.1260 0.3813 -0.0902 0.0126 -0.1501 0.0361 -0.1781 -0.2127 -0.1317 -0.1513 -0.1556 0.0949 0.0867 0.1119 0.1031 0.0739 0.1083 0.1131 0.1081 0.1129 0.1233 0.1007 0.1131 0.1132 0.1095 0.0874 0.0850 0.1047 0.0889 0.1929 0.1804 0.1419 0.1429 0.1690 0.1451 0.1445
va: 1.1963 1.9528 2.0161 3.1473 3.2541 3.1109 4.0334 3.8979 3.9277 3.8389 3.9531 3.9412 3.9550 3.8425 4.2452 3.8356 3.5793 3.9172 4.0386 3.9104 3.9787 4.0411 3.9815 3.9771 3.8102 1.0028 0.9919 1.0271 1.0242 1.0045 1.0189 1.0039 1.0014 1.0038 0.9966 1.0029 1.0018 1.0037 1.0134 1.0250 1.0040 1.0101 0.9796 0.9959 1.0027 1.0027 1.0021 1.0036 1.0041
dispcorr: -0.028833253 hartree
energy: -1513.540203000822
dipole: 23.94854 -23.16904 0.77949 4.63911 -2.53795 2.10116 6.56875 -7.40469 -0.83593
magnitude: 2.39192 au
magnitude: 6.07977 debye
