program: Orca
programVersion: 4.2.1
elementType: Cl O O N N N C C C C C C C C C C C C C C C C C C C H H H H H H H H H H H H H H H H H H H H H H H H
charge: 0
multiplicity: 1
keywords: wb97x-d3
keywords: def2-TZVPP
keywords: def2/J RIJCOSX GRIDX6 NOFINALGRIDX
keywords: grid4 nofinalgrid
keywords: scfconv7
keywords: smallprint printgap noloewdin
keywords: NOSOSCF
formula: C19H24ClN3O2
InChI: InChI=1S/C19H24ClN3O2/c1-18(2)13-25-19(3,23(18)17(24)22-12-11-21-14-22)10-4-5-15-6-8-16(20)9-7-15/h6-9,11-12,14H,4-5,10,13H2,1-3H3
49 atoms
Cl -4.917699 1.364088 -2.551134
O  1.898996 1.457809 -0.541981
O  2.000928 -1.346066 2.508162
N  1.891019 -0.619225 0.358364
N  1.797291 -2.903462 0.87141
N  2.341726 -5.021771 0.631172
C  1.829685 0.829616 0.718769
C  2.062031 -0.77905 -1.110121
C  2.613183 0.611614 -1.410029
C  0.473306 1.162853 1.334237
C  3.012637 1.277143 1.570855
C  3.07231 -1.833074 -1.536817
C  0.729413 -0.975035 -1.827696
C  0.229265 2.650599 1.558039
C  1.908724 -1.550046 1.313094
C  -1.226659 2.938416 1.940976
C  -2.18886 2.566108 0.84765
C  0.686717 -3.529468 0.360745
C  2.755376 -3.851431 1.027195
C  -2.257777 3.32459 -0.319551
C  -2.991098 1.432885 0.940309
C  1.048162 -4.833509 0.22102
C  -3.092716 2.966015 -1.365974
C  -3.834072 1.055346 -0.096063
C  -3.874191 1.827099 -1.24452
H  3.69353 0.654591 -1.224276
H  2.429848 0.919084 -2.438604
H  0.369147 0.637726 2.285294
H  -0.295271 0.762123 0.66816
H  3.960462 0.936132 1.152696
H  2.945114 0.920988 2.59443
H  3.0377 2.366304 1.600181
H  3.38122 -1.610673 -2.559708
H  2.660842 -2.840522 -1.548754
H  3.967995 -1.821102 -0.915872
H  0.887087 -0.923786 -2.905331
H  0.290183 -1.946886 -1.613669
H  0.004101 -0.206794 -1.560542
H  0.87534 3.024857 2.35518
H  0.477021 3.221775 0.660148
H  -1.323213 4.002073 2.169849
H  -1.47882 2.397111 2.856067
H  -0.246432 -3.018583 0.198103
H  3.73478 -3.619444 1.415817
H  -1.647168 4.214024 -0.420726
H  -2.959288 0.823679 1.835467
H  0.440435 -5.645978 -0.143425
H  -3.131203 3.56815 -2.263627
H  -4.446336 0.168515 -0.00405
elementType: Cl O N C H
totalener: -1513.51118121 hartree
nucrepener: 2424.69395104 hartree
electener: -3938.20513226 hartree
oneelecener: -6886.27306094 hartree
twoeener: 2948.06792868 hartree
cpcmener: -0.03733966 hartree
kineticenergy: 1508.16674155 hartree
xcener: -124.309192973149 hartree
chargesum: 0.0000000
charge: -0.108886 -0.388519 -0.489054 -0.066333 -0.032111 -0.381081 0.308522 0.127535 0.062704 -0.206346 -0.329391 -0.334454 -0.347476 -0.128825 0.379843 -0.086821 0.018817 -0.149259 0.035082 -0.217756 -0.186307 -0.132340 -0.155315 -0.148616 0.094528 0.088362 0.112396 0.105515 0.070071 0.108326 0.112594 0.107488 0.122984 0.100265 0.113516 0.113285 0.114975 0.107178 0.088159 0.084675 0.104865 0.087844 0.191913 0.181310 0.143273 0.143720 0.168989 0.144838 0.145321
qa: -0.1089 -0.3885 -0.4891 -0.0663 -0.0321 -0.3811 0.3085 0.1275 0.0627 -0.2063 -0.3294 -0.3345 -0.3475 -0.1288 0.3798 -0.0868 0.0188 -0.1493 0.0351 -0.2178 -0.1863 -0.1323 -0.1553 -0.1486 0.0945 0.0884 0.1124 0.1055 0.0701 0.1083 0.1126 0.1075 0.1230 0.1003 0.1135 0.1133 0.1150 0.1072 0.0882 0.0847 0.1049 0.0878 0.1919 0.1813 0.1433 0.1437 0.1690 0.1448 0.1453
va: 1.1965 1.9513 2.0158 3.1487 3.2531 3.1109 4.0373 3.9025 3.9313 3.8273 3.9550 3.9407 3.9568 3.8433 4.2454 3.8423 3.5801 3.9151 4.0382 3.9827 3.9095 4.0417 3.9781 3.9758 3.8134 1.0030 0.9919 1.0277 1.0267 1.0046 1.0193 1.0039 1.0042 0.9966 1.0010 1.0031 1.0013 1.0034 1.0120 1.0258 1.0036 1.0102 0.9800 0.9953 1.0026 1.0023 1.0022 1.0042 1.0035
dispcorr: -0.028922437 hartree
energy: -1513.540103648657
dipole: 23.12589 -22.55126 0.57463 4.61365 -2.68034 1.93331 5.26354 -6.33457 -1.07104
magnitude: 2.28364 au
magnitude: 5.80454 debye
