program: Orca
programVersion: 4.2.1
elementType: Cl O O N N N C C C C C C C C C C C C C C C C C C C H H H H H H H H H H H H H H H H H H H H H H H H
charge: 0
multiplicity: 1
keywords: wb97x-d3
keywords: def2-TZVPP
keywords: def2/J RIJCOSX GRIDX6 NOFINALGRIDX
keywords: grid4 nofinalgrid
keywords: scfconv7
keywords: smallprint printgap noloewdin
keywords: NOSOSCF
formula: C19H24ClN3O2
InChI: InChI=1S/C19H24ClN3O2/c1-18(2)13-25-19(3,23(18)17(24)22-12-11-21-14-22)10-4-5-15-6-8-16(20)9-7-15/h6-9,11-12,14H,4-5,10,13H2,1-3H3
49 atoms
Cl -4.845097 0.697633 -2.579101
O  2.562286 1.639993 0.195691
O  1.907438 -2.465507 -1.330478
N  2.373556 -0.573056 -0.170708
N  0.914421 -2.207808 0.690331
N  -0.94079 -2.938777 1.62221
C  2.061967 0.492641 0.838611
C  3.315581 -0.052672 -1.193501
C  3.713533 1.258735 -0.521178
C  0.563885 0.697518 1.059302
C  2.808889 0.263501 2.148217
C  4.534228 -0.939979 -1.392932
C  2.608211 0.241166 -2.515307
C  0.19731 2.063188 1.633105
C  1.774938 -1.750987 -0.356356
C  -1.274711 2.112229 2.058422
C  -2.21178 1.774418 0.933472
C  1.267757 -2.681231 1.93017
C  -0.422674 -2.401688 0.55463
C  -2.458296 2.692811 -0.084728
C  -2.806142 0.519031 0.842855
C  0.10742 -3.125452 2.484363
C  -3.266987 2.37322 -1.164453
C  -3.616944 0.177522 -0.23035
C  -3.838244 1.111502 -1.228516
H  4.579415 1.127651 0.139051
H  3.954846 2.037862 -1.243434
H  0.198378 -0.066363 1.747506
H  0.040181 0.554954 0.11061
H  2.379133 -0.555681 2.719027
H  2.742866 1.157314 2.768524
H  3.864466 0.042813 1.990039
H  4.972797 -1.234833 -0.43889
H  5.292282 -0.381168 -1.94452
H  4.310396 -1.837253 -1.964711
H  3.309198 0.724023 -3.197332
H  2.246017 -0.660867 -3.001418
H  1.764464 0.917476 -2.372144
H  0.807052 2.295562 2.509399
H  0.387044 2.849158 0.899824
H  -1.495031 3.11237 2.438013
H  -1.432619 1.418908 2.888001
H  2.287165 -2.705398 2.274844
H  -0.956565 -2.116368 -0.338098
H  -2.011961 3.679171 -0.040582
H  -2.63136 -0.215221 1.619416
H  -0.025147 -3.5766 3.454357
H  -3.4480 3.100691 -1.943964
H  -4.067233 -0.804543 -0.282467
elementType: Cl O N C H
totalener: -1513.50956537 hartree
nucrepener: 2470.76744596 hartree
electener: -3984.27701133 hartree
oneelecener: -6978.79504487 hartree
twoeener: 2994.51803354 hartree
cpcmener: -0.03610418 hartree
kineticenergy: 1508.16536998 hartree
xcener: -124.309009928950 hartree
chargesum: 0.0000000
charge: -0.107416 -0.372115 -0.485564 -0.037014 -0.025484 -0.379292 0.199552 0.130115 0.079274 -0.154042 -0.314109 -0.319179 -0.351549 -0.151603 0.382304 -0.094284 0.041999 -0.155885 0.030918 -0.206823 -0.198061 -0.119926 -0.149926 -0.152647 0.097844 0.085049 0.112146 0.072275 0.099892 0.116929 0.110968 0.109166 0.101924 0.114349 0.104831 0.107576 0.107350 0.107682 0.092476 0.080889 0.101989 0.091154 0.195775 0.172446 0.142752 0.128652 0.168200 0.144563 0.143881
qa: -0.1074 -0.3721 -0.4856 -0.0370 -0.0255 -0.3793 0.1996 0.1301 0.0793 -0.1540 -0.3141 -0.3192 -0.3515 -0.1516 0.3823 -0.0943 0.0420 -0.1559 0.0309 -0.2068 -0.1981 -0.1199 -0.1499 -0.1526 0.0978 0.0850 0.1121 0.0723 0.0999 0.1169 0.1110 0.1092 0.1019 0.1143 0.1048 0.1076 0.1073 0.1077 0.0925 0.0809 0.1020 0.0912 0.1958 0.1724 0.1428 0.1287 0.1682 0.1446 0.1439
va: 1.1985 1.9595 2.0183 3.1459 3.2530 3.0816 4.1026 3.9210 3.8819 3.8189 3.9731 3.9156 3.9252 3.9046 4.2323 3.8232 3.5580 3.8980 4.0175 3.9774 3.9084 4.0173 3.9744 3.9690 3.8098 1.0037 0.9933 1.0058 1.0071 1.0014 1.0068 1.0046 1.0038 0.9994 1.0158 1.0016 1.0189 1.0064 1.0185 1.0237 1.0065 1.0097 0.9803 0.9998 1.0031 1.0227 1.0004 1.0043 1.0048
dispcorr: -0.030349420 hartree
energy: -1513.539914785255
dipole: 32.17423 -29.30318 2.87105 7.43505 -5.29414 2.14090 11.76973 -10.47648 1.29325
magnitude: 3.80774 au
magnitude: 9.67851 debye
