program: Orca
programVersion: 4.2.1
elementType: Cl O O N N N C C C C C C C C C C C C C C C C C C C H H H H H H H H H H H H H H H H H H H H H H H H
charge: 0
multiplicity: 1
keywords: wb97x-d3
keywords: def2-TZVPP
keywords: def2/J RIJCOSX GRIDX6 NOFINALGRIDX
keywords: grid4 nofinalgrid
keywords: scfconv7
keywords: smallprint printgap noloewdin
keywords: NOSOSCF
formula: C19H24ClN3O2
InChI: InChI=1S/C19H24ClN3O2/c1-18(2)13-25-19(3,23(18)17(24)22-12-11-21-14-22)10-4-5-15-6-8-16(20)9-7-15/h6-9,11-12,14H,4-5,10,13H2,1-3H3
49 atoms
Cl -5.937374 1.629217 -1.918467
O  2.905611 1.699037 0.031424
O  1.879924 -1.611255 2.286369
N  2.375198 -0.459157 0.39441
N  1.602965 -2.667836 0.29427
N  0.308704 -4.029849 -0.853409
C  2.596437 0.835277 1.100056
C  2.835812 -0.377175 -1.018247
C  3.607273 0.942527 -0.926844
C  1.339837 1.364026 1.786212
C  3.76909 0.765897 2.073408
C  3.78102 -1.496833 -1.428964
C  1.691435 -0.234869 -2.016484
C  0.08803 1.385735 0.922872
C  1.975402 -1.531402 1.077217
C  -1.127035 1.910338 1.689476
C  -2.361414 1.864395 0.836049
C  2.211537 -3.898124 0.329421
C  0.454439 -2.811853 -0.416167
C  -3.07361 0.676128 0.686394
C  -2.785771 2.979119 0.119067
C  1.408148 -4.713766 -0.403691
C  -4.172839 0.593348 -0.154362
C  -3.884395 2.918347 -0.726789
C  -4.56755 1.720609 -0.857972
H  4.647891 0.77075 -0.624099
H  3.615196 1.483158 -1.872921
H  1.572087 2.378213 2.125311
H  1.155364 0.783904 2.691004
H  4.677092 0.397112 1.594668
H  3.555324 0.123075 2.922775
H  3.972392 1.766687 2.456352
H  4.323543 -1.182169 -2.322114
H  3.264916 -2.420725 -1.6830
H  4.518841 -1.708359 -0.654183
H  2.103454 0.013476 -2.995347
H  1.126972 -1.156767 -2.138807
H  0.999998 0.558985 -1.735499
H  0.244586 2.003412 0.03558
H  -0.143487 0.37926 0.562646
H  -0.938871 2.933694 2.022748
H  -1.27438 1.306935 2.589009
H  3.147599 -4.064859 0.835116
H  -0.252097 -2.006824 -0.544411
H  -2.767888 -0.206973 1.23492
H  -2.25183 3.916531 0.216614
H  1.563465 -5.75568 -0.632457
H  -4.711936 -0.338667 -0.256467
H  -4.198418 3.795945 -1.275217
elementType: Cl O N C H
totalener: -1513.51224872 hartree
nucrepener: 2404.48774128 hartree
electener: -3917.99999000 hartree
oneelecener: -6845.95293677 hartree
twoeener: 2927.95294677 hartree
cpcmener: -0.03663935 hartree
kineticenergy: 1508.16773483 hartree
xcener: -124.308136943738 hartree
chargesum: 0.0000000
charge: -0.108186 -0.396202 -0.475852 -0.042343 -0.017909 -0.386572 0.300608 0.097583 0.085081 -0.218040 -0.311519 -0.340901 -0.364516 -0.100405 0.347571 -0.069419 0.036781 -0.157659 0.034046 -0.239183 -0.213824 -0.113151 -0.141408 -0.145968 0.083500 0.086272 0.112134 0.102974 0.095755 0.103312 0.108497 0.110037 0.123595 0.105473 0.114925 0.115342 0.122490 0.124202 0.088484 0.048804 0.087988 0.096235 0.189284 0.172479 0.146255 0.143264 0.169336 0.145689 0.145063
qa: -0.1082 -0.3962 -0.4759 -0.0423 -0.0179 -0.3866 0.3006 0.0976 0.0851 -0.2180 -0.3115 -0.3409 -0.3645 -0.1004 0.3476 -0.0694 0.0368 -0.1577 0.0340 -0.2392 -0.2138 -0.1132 -0.1414 -0.1460 0.0835 0.0863 0.1121 0.1030 0.0958 0.1033 0.1085 0.1100 0.1236 0.1055 0.1149 0.1153 0.1225 0.1242 0.0885 0.0488 0.0880 0.0962 0.1893 0.1725 0.1463 0.1433 0.1693 0.1457 0.1451
va: 1.1970 1.9660 2.0300 3.1411 3.2412 3.1069 4.0196 3.9170 3.8836 3.7762 3.9488 3.9425 3.9364 3.8795 4.2527 3.8112 3.5742 3.9175 4.0430 3.9712 3.9778 4.0078 3.9698 3.9646 3.8157 1.0047 0.9939 1.0205 1.0283 1.0038 1.0198 1.0073 1.0025 0.9942 1.0003 1.0049 0.9987 0.9957 1.0262 1.0235 1.0125 1.0058 0.9914 0.9905 1.0017 1.0034 0.9996 1.0041 1.0045
dispcorr: -0.028977405 hartree
energy: -1513.541226120246
dipole: 34.29965 -31.50121 2.79844 1.46159 -0.04865 1.41294 4.92014 -5.29175 -0.37162
magnitude: 3.15686 au
magnitude: 8.02409 debye
