program: Orca
programVersion: 4.2.1
elementType: Cl O O N N N C C C C C C C C C C C C C C C C C C C H H H H H H H H H H H H H H H H H H H H H H H H
charge: 0
multiplicity: 1
keywords: wb97x-d3
keywords: def2-TZVPP
keywords: def2/J RIJCOSX GRIDX6 NOFINALGRIDX
keywords: grid4 nofinalgrid
keywords: scfconv7
keywords: smallprint printgap noloewdin
keywords: NOSOSCF
formula: C19H24ClN3O2
InChI: InChI=1S/C19H24ClN3O2/c1-18(2)13-25-19(3,23(18)17(24)22-12-11-21-14-22)10-4-5-15-6-8-16(20)9-7-15/h6-9,11-12,14H,4-5,10,13H2,1-3H3
49 atoms
Cl -4.544051 1.81008 -2.972356
O  2.412946 1.415656 0.414636
O  2.547473 -2.76681 -1.022826
N  2.041992 -0.71286 -0.202619
N  1.488542 -2.663053 0.983774
N  -0.065859 -3.611365 2.220637
C  1.829399 0.245048 0.928779
C  2.46065 0.015748 -1.424116
C  2.164932 1.444103 -0.968927
C  0.332211 0.460396 1.194274
C  2.602094 -0.112759 2.186053
C  3.954685 -0.142408 -1.699763
C  1.624994 -0.345962 -2.642324
C  0.004061 1.73928 1.953941
C  2.08256 -2.047675 -0.164808
C  -1.499204 1.87022 2.223727
C  -2.310355 1.870357 0.958427
C  2.143973 -3.48478 1.867673
C  0.156937 -2.801053 1.227908
C  -2.294774 2.973916 0.107801
C  -3.042025 0.752922 0.567777
C  1.166981 -4.037717 2.635386
C  -2.978921 2.966265 -1.097463
C  -3.732952 0.723923 -0.635425
C  -3.691964 1.83428 -1.461438
H  2.826695 2.175261 -1.432755
H  1.130361 1.73728 -1.19217
H  -0.048152 -0.386935 1.765685
H  -0.208189 0.452704 0.244496
H  2.661776 0.764451 2.830212
H  3.621265 -0.420308 1.951536
H  2.12158 -0.898525 2.762853
H  4.554058 0.175183 -0.84542
H  4.23448 0.479368 -2.551617
H  4.220416 -1.168919 -1.941128
H  1.805979 0.385332 -3.431559
H  1.873909 -1.326239 -3.04245
H  0.558796 -0.32741 -2.413806
H  0.526586 1.7604 2.91349
H  0.344985 2.613695 1.395336
H  -1.674849 2.795639 2.777484
H  -1.826654 1.053283 2.871625
H  3.217126 -3.574746 1.884555
H  -0.591836 -2.308563 0.62715
H  -1.737973 3.861539 0.385157
H  -3.0737 -0.120416 1.208669
H  1.285709 -4.716853 3.46495
H  -2.954985 3.834167 -1.742766
H  -4.292445 -0.156942 -0.920411
elementType: Cl O N C H
totalener: -1513.52115529 hartree
nucrepener: 2446.42314933 hartree
electener: -3959.94430462 hartree
oneelecener: -6929.45592677 hartree
twoeener: 2969.51162215 hartree
cpcmener: -0.03000396 hartree
kineticenergy: 1508.16789164 hartree
xcener: -124.306549483678 hartree
chargesum: -0.0000000
charge: -0.105110 -0.376234 -0.454443 -0.060322 -0.036174 -0.376045 0.369198 0.118318 0.056020 -0.318713 -0.325895 -0.342858 -0.316653 -0.148095 0.371866 -0.094977 0.034671 -0.156903 0.030132 -0.224679 -0.178234 -0.108512 -0.140329 -0.150843 0.089952 0.115061 0.080133 0.106377 0.097859 0.115835 0.119899 0.107495 0.106357 0.105061 0.108338 0.113803 0.109536 0.097070 0.093206 0.085589 0.102509 0.089854 0.184421 0.175531 0.139726 0.138129 0.165345 0.143562 0.144170
qa: -0.1051 -0.3762 -0.4544 -0.0603 -0.0362 -0.3760 0.3692 0.1183 0.0560 -0.3187 -0.3259 -0.3429 -0.3167 -0.1481 0.3719 -0.0950 0.0347 -0.1569 0.0301 -0.2247 -0.1782 -0.1085 -0.1403 -0.1508 0.0900 0.1151 0.0801 0.1064 0.0979 0.1158 0.1199 0.1075 0.1064 0.1051 0.1083 0.1138 0.1095 0.0971 0.0932 0.0856 0.1025 0.0899 0.1844 0.1755 0.1397 0.1381 0.1653 0.1436 0.1442
va: 1.2001 1.9693 2.0553 3.1289 3.2738 3.0973 3.9627 3.9515 3.9239 3.9174 3.9655 3.9265 3.9181 3.8920 4.2473 3.8247 3.5551 3.9181 4.0282 3.9767 3.9201 4.0111 3.9707 3.9905 3.8281 0.9952 0.9996 1.0147 1.0087 1.0089 1.0033 0.9910 1.0068 1.0018 1.0203 1.0001 1.0150 1.0036 1.0137 1.0213 1.0059 1.0110 0.9933 0.9908 1.0039 1.0032 1.0000 1.0040 1.0042
dispcorr: -0.029695850 hartree
energy: -1513.550851143248
dipole: 23.78198 -22.70831 1.07367 3.86620 -1.67416 2.19203 10.88011 -10.37856 0.50155
magnitude: 2.49185 au
magnitude: 6.33379 debye
