program: Orca
programVersion: 4.2.1
elementType: Cl O O N N N C C C C C C C C C C C C C C C C C C C H H H H H H H H H H H H H H H H H H H H H H H H
charge: 0
multiplicity: 1
keywords: wb97x-d3
keywords: def2-TZVPP
keywords: def2/J RIJCOSX GRIDX6 NOFINALGRIDX
keywords: grid4 nofinalgrid
keywords: scfconv7
keywords: smallprint printgap noloewdin
keywords: NOSOSCF
formula: C19H24ClN3O2
InChI: InChI=1S/C19H24ClN3O2/c1-18(2)13-25-19(3,23(18)17(24)22-12-11-21-14-22)10-4-5-15-6-8-16(20)9-7-15/h6-9,11-12,14H,4-5,10,13H2,1-3H3
49 atoms
Cl -4.509751 -1.218955 0.339759
O  3.351627 1.59321 0.453342
O  0.099419 -0.654677 1.627232
N  1.830406 -0.049825 0.281718
N  0.325794 -1.743024 -0.344003
N  -0.626615 -2.583948 -2.142974
C  2.211234 1.121366 1.123445
C  2.973166 -0.457704 -0.584303
C  4.053226 0.462727 0.003416
C  1.151436 2.215184 1.115018
C  2.567175 0.726869 2.557904
C  3.376446 -1.915174 -0.410073
C  2.787325 -0.121807 -2.061308
C  0.780346 2.768418 -0.257269
C  0.746714 -0.772762 0.610511
C  -0.639806 3.350647 -0.285536
C  -1.676768 2.272869 -0.134655
C  -0.025081 -3.035053 -0.031434
C  -0.085433 -1.522961 -1.62326
C  -1.995655 1.453293 -1.215574
C  -2.282227 2.003206 1.089036
C  -0.584724 -3.539353 -1.161924
C  -2.867866 0.384809 -1.082676
C  -3.154381 0.935618 1.245076
C  -3.433059 0.128495 0.1560
H  4.596083 -0.030791 0.819143
H  4.783691 0.771309 -0.744045
H  1.513121 3.026534 1.753173
H  0.271036 1.818808 1.620144
H  3.231576 -0.136734 2.603491
H  1.683888 0.492829 3.145192
H  3.073864 1.565211 3.037946
H  3.419826 -2.201144 0.641838
H  4.373441 -2.060404 -0.83038
H  2.712889 -2.605489 -0.928493
H  3.743058 -0.238104 -2.574592
H  2.087245 -0.786153 -2.561345
H  2.457906 0.906991 -2.209471
H  1.490185 3.541397 -0.557519
H  0.841184 1.986401 -1.0184
H  -0.78725 3.875813 -1.232183
H  -0.751452 4.097366 0.505008
H  0.177163 -3.471199 0.932102
H  -0.00136 -0.559224 -2.097284
H  -1.552944 1.647133 -2.186083
H  -2.069356 2.630731 1.946321
H  -0.957863 -4.538503 -1.323923
H  -3.094747 -0.24369 -1.933164
H  -3.605043 0.738407 2.20854
elementType: Cl O N C H
totalener: -1513.51807991 hartree
nucrepener: 2574.95944764 hartree
electener: -4088.47752754 hartree
oneelecener: -7187.94470278 hartree
twoeener: 3099.46717523 hartree
cpcmener: -0.02948307 hartree
kineticenergy: 1508.16326153 hartree
xcener: -124.310018294437 hartree
chargesum: -0.0000000
charge: -0.110359 -0.383704 -0.438906 -0.020376 0.030535 -0.368369 0.243928 0.086238 0.094026 -0.181572 -0.322958 -0.333919 -0.368543 -0.126816 0.321729 -0.108893 0.104944 -0.164594 -0.017797 -0.278440 -0.218449 -0.096838 -0.131290 -0.142478 0.114777 0.082593 0.108556 0.107483 0.093902 0.099704 0.110461 0.109866 0.111001 0.118914 0.106289 0.114169 0.117295 0.125039 0.087068 0.049849 0.097865 0.087607 0.178706 0.177593 0.150173 0.145095 0.164558 0.133937 0.140395
qa: -0.1104 -0.3837 -0.4389 -0.0204 0.0305 -0.3684 0.2439 0.0862 0.0940 -0.1816 -0.3230 -0.3339 -0.3685 -0.1268 0.3217 -0.1089 0.1049 -0.1646 -0.0178 -0.2784 -0.2184 -0.0968 -0.1313 -0.1425 0.1148 0.0826 0.1086 0.1075 0.0939 0.0997 0.1105 0.1099 0.1110 0.1189 0.1063 0.1142 0.1173 0.1250 0.0871 0.0498 0.0979 0.0876 0.1787 0.1776 0.1502 0.1451 0.1646 0.1339 0.1404
va: 1.1947 1.9743 2.0614 3.1074 3.2343 3.1066 4.1314 3.9253 3.8690 3.7227 3.9425 3.9516 3.9264 3.9142 4.2333 3.8991 3.5202 3.9204 4.0895 3.9146 3.9520 4.0006 3.9011 3.9865 3.7975 1.0035 0.9935 1.0187 1.0303 1.0036 1.0186 1.0103 1.0000 1.0028 0.9969 1.0052 1.0012 0.9957 1.0200 1.0203 1.0061 1.0075 0.9994 0.9820 0.9988 0.9977 0.9986 1.0160 1.0043
dispcorr: -0.034040595 hartree
energy: -1513.552120500131
dipole: 32.53973 -29.64278 2.89695 11.31613 -10.29554 1.02059 -1.48194 1.64638 0.16444
magnitude: 3.07587 au
magnitude: 7.81824 debye
