program: Orca
programVersion: 4.2.1
elementType: Cl O O N N N C C C C C C C C C C C C C C C C C C C H H H H H H H H H H H H H H H H H H H H H H H H
charge: 0
multiplicity: 1
keywords: wb97x-d3
keywords: def2-TZVPP
keywords: def2/J RIJCOSX GRIDX6 NOFINALGRIDX
keywords: grid4 nofinalgrid
keywords: scfconv7
keywords: smallprint printgap noloewdin
keywords: NOSOSCF
formula: C19H24ClN3O2
InChI: InChI=1S/C19H24ClN3O2/c1-18(2)13-25-19(3,23(18)17(24)22-12-11-21-14-22)10-4-5-15-6-8-16(20)9-7-15/h6-9,11-12,14H,4-5,10,13H2,1-3H3
49 atoms
Cl -6.565051 4.776333 0.316243
O  1.901441 0.965893 0.477817
O  1.163477 -3.086129 0.791163
N  2.309128 -1.227626 0.174304
N  3.218696 -3.370151 -0.132411
N  5.058719 -4.572654 -0.026095
C  1.30267 -0.279556 0.737001
C  3.318409 -0.495988 -0.634415
C  2.594802 0.849831 -0.738067
C  -0.038116 -0.397088 -0.003545
C  1.164619 -0.412906 2.243185
C  4.636266 -0.306228 0.110421
C  3.546419 -1.064594 -2.027462
C  -1.035704 0.695585 0.366322
C  2.138607 -2.544539 0.31456
C  -2.281378 0.607446 -0.50363
C  -3.327919 1.666134 -0.266143
C  3.129848 -4.304147 -1.135131
C  4.391977 -3.596437 0.517466
C  -3.25368 2.593053 0.76835
C  -4.432622 1.729027 -1.116909
C  4.286146 -5.017042 -1.064678
C  -4.243463 3.550798 0.954877
C  -5.428938 2.674815 -0.948545
C  -5.325087 3.58427 0.093974
H  3.286652 1.686068 -0.836281
H  1.915375 0.870743 -1.599735
H  -0.476841 -1.373366 0.202159
H  0.144165 -0.368227 -1.082533
H  2.143597 -0.473176 2.719737
H  0.588395 -1.291505 2.522292
H  0.652464 0.46049 2.646932
H  4.480789 0.110267 1.106152
H  5.272447 0.384341 -0.445158
H  5.194139 -1.234582 0.211864
H  2.607974 -1.337064 -2.51213
H  4.021704 -0.298493 -2.643196
H  4.20701 -1.929407 -2.0372
H  -1.316634 0.600514 1.418598
H  -0.575779 1.679894 0.249104
H  -2.746038 -0.375332 -0.370893
H  -1.98579 0.647907 -1.55681
H  2.286919 -4.354626 -1.80394
H  4.683475 -3.038086 1.393345
H  -2.416287 2.588989 1.453656
H  -4.518394 1.022415 -1.934376
H  4.603543 -5.823665 -1.706742
H  -4.162574 4.261105 1.766886
H  -6.273997 2.701916 -1.623419
elementType: Cl O N C H
totalener: -1513.52199053 hartree
nucrepener: 2300.27032617 hartree
electener: -3813.79231670 hartree
oneelecener: -6637.14943408 hartree
twoeener: 2823.35711738 hartree
cpcmener: -0.03241134 hartree
kineticenergy: 1508.15251564 hartree
xcener: -124.305549167187 hartree
chargesum: 0.0000000
charge: -0.106779 -0.388241 -0.457980 -0.066552 -0.036966 -0.376702 0.378121 0.103759 0.056472 -0.275413 -0.324409 -0.347572 -0.334266 -0.080839 0.369159 -0.069622 0.042773 -0.153329 0.028718 -0.203834 -0.216919 -0.113124 -0.183377 -0.166569 0.109429 0.113968 0.085852 0.106287 0.084015 0.108774 0.108713 0.109972 0.114903 0.107219 0.115709 0.111602 0.119766 0.105136 0.076061 0.078464 0.090979 0.087386 0.183406 0.179288 0.141145 0.138041 0.164789 0.141272 0.141317
qa: -0.1068 -0.3882 -0.4580 -0.0666 -0.0370 -0.3767 0.3781 0.1038 0.0565 -0.2754 -0.3244 -0.3476 -0.3343 -0.0808 0.3692 -0.0696 0.0428 -0.1533 0.0287 -0.2038 -0.2169 -0.1131 -0.1834 -0.1666 0.1094 0.1140 0.0859 0.1063 0.0840 0.1088 0.1087 0.1100 0.1149 0.1072 0.1157 0.1116 0.1198 0.1051 0.0761 0.0785 0.0910 0.0874 0.1834 0.1793 0.1411 0.1380 0.1648 0.1413 0.1413
va: 1.1988 1.9690 2.0528 3.1601 3.2584 3.1063 3.9568 3.9468 3.9200 3.8920 3.9293 3.9472 3.9467 3.8289 4.2594 3.8216 3.6546 3.9158 4.0399 3.9569 4.0204 4.0125 4.0516 3.9925 3.8037 0.9912 1.0003 1.0338 1.0083 1.0078 1.0144 1.0003 1.0054 1.0038 1.0011 1.0008 1.0039 0.9942 1.0027 1.0255 1.0003 1.0033 0.9937 0.9864 1.0056 1.0043 1.0008 1.0075 1.0062
dispcorr: -0.027016460 hartree
energy: -1513.549006991247
dipole: 29.19012 -28.56791 0.62221 -10.86409 12.08884 1.22475 -4.54595 3.15053 -1.39542
magnitude: 1.95815 au
magnitude: 4.97723 debye
