program: Orca
programVersion: 4.2.1
elementType: Cl O O N N N C C C C C C C C C C C C C C C C C C C H H H H H H H H H H H H H H H H H H H H H H H H
charge: 0
multiplicity: 1
keywords: wb97x-d3
keywords: def2-TZVPP
keywords: def2/J RIJCOSX GRIDX6 NOFINALGRIDX
keywords: grid4 nofinalgrid
keywords: scfconv7
keywords: smallprint printgap noloewdin
keywords: NOSOSCF
formula: C19H24ClN3O2
InChI: InChI=1S/C19H24ClN3O2/c1-18(2)13-25-19(3,23(18)17(24)22-12-11-21-14-22)10-4-5-15-6-8-16(20)9-7-15/h6-9,11-12,14H,4-5,10,13H2,1-3H3
49 atoms
Cl -4.655106 -0.648502 2.014842
O  2.545267 1.533658 0.785609
O  2.713649 -2.66746 -0.61781
N  2.390867 -0.451292 -0.26538
N  0.586651 -1.881941 -0.751045
N  -1.275396 -2.146337 -1.895678
C  1.568435 0.712491 0.192482
C  3.835878 -0.142508 -0.144468
C  3.741426 1.366327 0.066182
C  0.913292 1.436624 -0.989999
C  0.571186 0.355708 1.282681
C  4.453928 -0.806564 1.084467
C  4.621597 -0.457868 -1.407812
C  0.374853 2.833374 -0.642818
C  1.990324 -1.698167 -0.529437
C  -1.072122 3.054895 -1.099355
C  -2.031292 2.166633 -0.358409
C  -0.234288 -2.670774 0.017988
C  -0.0864 -1.618396 -1.904342
C  -2.358598 2.4384 0.969334
C  -2.552602 1.014423 -0.937315
C  -1.384452 -2.79627 -0.696216
C  -3.165017 1.585104 1.703975
C  -3.360326 0.144067 -0.218286
C  -3.655525 0.436079 1.101098
H  4.568628 1.759488 0.656839
H  3.721395 1.90433 -0.89066
H  0.10299 0.810281 -1.361891
H  1.62723 1.510118 -1.813482
H  0.242417 1.26495 1.784305
H  1.025761 -0.288579 2.036226
H  -0.32018 -0.129638 0.892474
H  3.92101 -0.533433 1.996361
H  5.48931 -0.480529 1.194901
H  4.458095 -1.891268 1.003346
H  5.595482 0.032367 -1.353823
H  4.79885 -1.523356 -1.535315
H  4.112635 -0.082341 -2.2968
H  0.430693 3.025169 0.430842
H  1.007119 3.593841 -1.10465
H  -1.151725 2.877395 -2.174778
H  -1.33531 4.102938 -0.936389
H  0.058635 -3.036249 0.987971
H  0.356515 -1.06057 -2.715034
H  -1.970981 3.330375 1.448176
H  -2.326455 0.777048 -1.969568
H  -2.284268 -3.316725 -0.40817
H  -3.404006 1.812175 2.734465
H  -3.746215 -0.749916 -0.687956
elementType: Cl O N C H
totalener: -1513.51725886 hartree
nucrepener: 2525.41811598 hartree
electener: -4038.93537484 hartree
oneelecener: -7088.00913402 hartree
twoeener: 3049.07375918 hartree
cpcmener: -0.02946684 hartree
kineticenergy: 1508.16256522 hartree
xcener: -124.308502255014 hartree
chargesum: -0.0000000
charge: -0.106853 -0.373778 -0.454612 -0.053732 -0.021699 -0.369864 0.343603 0.136105 0.056498 -0.208542 -0.364110 -0.347923 -0.323369 -0.181301 0.365512 -0.097273 0.095851 -0.140560 0.019074 -0.262904 -0.198463 -0.110011 -0.125955 -0.133420 0.091111 0.113784 0.083289 0.061496 0.115955 0.117300 0.124783 0.078628 0.105392 0.105421 0.108572 0.113091 0.108434 0.099272 0.077319 0.092662 0.092041 0.096792 0.181456 0.179377 0.140859 0.138406 0.156925 0.141896 0.133465
qa: -0.1069 -0.3738 -0.4546 -0.0537 -0.0217 -0.3699 0.3436 0.1361 0.0565 -0.2085 -0.3641 -0.3479 -0.3234 -0.1813 0.3655 -0.0973 0.0959 -0.1406 0.0191 -0.2629 -0.1985 -0.1100 -0.1260 -0.1334 0.0911 0.1138 0.0833 0.0615 0.1160 0.1173 0.1248 0.0786 0.1054 0.1054 0.1086 0.1131 0.1084 0.0993 0.0773 0.0927 0.0920 0.0968 0.1815 0.1794 0.1409 0.1384 0.1569 0.1419 0.1335
va: 1.2004 1.9713 2.0549 3.1313 3.2574 3.0757 3.9576 3.9362 3.9332 3.8780 4.0057 3.9295 3.9121 3.9123 4.2538 3.8354 3.5461 3.8880 4.0199 3.9574 3.9105 3.9834 3.9529 3.9249 3.8312 0.9924 1.0002 1.0335 1.0099 1.0075 1.0078 0.9897 1.0074 1.0020 1.0185 0.9999 1.0156 1.0048 1.0252 1.0136 1.0080 1.0072 0.9944 0.9882 1.0023 1.0100 1.0037 1.0043 1.0115
dispcorr: -0.033543034 hartree
energy: -1513.550801894716
dipole: 30.10959 -28.23804 1.87155 13.79113 -11.31085 2.48029 -6.49304 6.66613 0.17308
magnitude: 3.11199 au
magnitude: 7.91005 debye
