program: Orca
programVersion: 4.2.1
elementType: Cl O O N N N C C C C C C C C C C C C C C C C C C C H H H H H H H H H H H H H H H H H H H H H H H H
charge: 0
multiplicity: 1
keywords: wb97x-d3
keywords: def2-TZVPP
keywords: def2/J RIJCOSX GRIDX6 NOFINALGRIDX
keywords: grid4 nofinalgrid
keywords: scfconv7
keywords: smallprint printgap noloewdin
keywords: NOSOSCF
formula: C19H24ClN3O2
InChI: InChI=1S/C19H24ClN3O2/c1-18(2)13-25-19(3,23(18)17(24)22-12-11-21-14-22)10-4-5-15-6-8-16(20)9-7-15/h6-9,11-12,14H,4-5,10,13H2,1-3H3
49 atoms
Cl -5.215351 -0.531854 0.54177
O  3.291106 1.656978 0.385289
O  0.227333 -0.81801 1.638527
N  1.972274 -0.162538 0.33438
N  0.724416 -2.078689 -0.177163
N  -0.003302 -3.197111 -1.928598
C  2.136113 1.157447 1.010446
C  3.212899 -0.527329 -0.407228
C  4.137339 0.559879 0.153769
C  0.973891 2.100426 0.720887
C  2.370331 1.03572 2.516225
C  3.75318 -1.905915 -0.053879
C  3.101339 -0.362523 -1.919889
C  0.709957 2.38568 -0.751019
C  0.960462 -0.968577 0.686832
C  -0.636856 3.080231 -0.974848
C  -1.804351 2.206098 -0.607383
C  0.551145 -3.37751 0.236458
C  0.351721 -2.027888 -1.485582
C  -2.588505 2.46993 0.510764
C  -2.105055 1.075337 -1.364964
C  0.128303 -4.051413 -0.86584
C  -3.639158 1.637437 0.871434
C  -3.145776 0.228662 -1.020548
C  -3.906476 0.519059 0.10135
H  4.628374 0.222766 1.075307
H  4.91405 0.849801 -0.553302
H  1.177119 3.039614 1.244537
H  0.080944 1.687549 1.19301
H  3.120396 0.283471 2.763222
H  1.459521 0.784255 3.051714
H  2.72261 1.997265 2.892187
H  3.216061 -2.714063 -0.54783
H  3.73827 -2.085825 1.022077
H  4.792328 -1.971524 -0.382237
H  2.493635 -1.136503 -2.382754
H  2.694463 0.609281 -2.198738
H  4.095553 -0.442592 -2.362023
H  1.502676 3.012938 -1.162757
H  0.7231 1.457765 -1.328532
H  -0.712458 3.368925 -2.026258
H  -0.674099 4.007766 -0.397814
H  0.765633 -3.697782 1.24204
H  0.327637 -1.104847 -2.042545
H  -2.380448 3.341792 1.119365
H  -1.522029 0.847697 -2.250042
H  -0.086117 -5.104987 -0.952781
H  -4.236964 1.862452 1.744444
H  -3.360922 -0.643487 -1.623249
elementType: Cl O N C H
totalener: -1513.52048772 hartree
nucrepener: 2505.41634154 hartree
electener: -4018.93682926 hartree
oneelecener: -7048.52033954 hartree
twoeener: 3029.58351028 hartree
cpcmener: -0.03073789 hartree
kineticenergy: 1508.16161941 hartree
xcener: -124.307164866307 hartree
chargesum: 0.0000000
charge: -0.106635 -0.383209 -0.438888 -0.042488 0.000503 -0.376329 0.259328 0.097871 0.089052 -0.180879 -0.316740 -0.335277 -0.372748 -0.116422 0.338972 -0.117508 0.060922 -0.158032 0.011096 -0.195602 -0.259154 -0.102972 -0.138385 -0.130176 0.090046 0.083084 0.109629 0.104820 0.094641 0.100574 0.109590 0.108766 0.106082 0.113236 0.119238 0.119657 0.125241 0.113057 0.088232 0.045532 0.105116 0.086462 0.183079 0.170986 0.140029 0.150166 0.165364 0.142053 0.139022
qa: -0.1066 -0.3832 -0.4389 -0.0425 0.0005 -0.3763 0.2593 0.0979 0.0891 -0.1809 -0.3167 -0.3353 -0.3727 -0.1164 0.3390 -0.1175 0.0609 -0.1580 0.0111 -0.1956 -0.2592 -0.1030 -0.1384 -0.1302 0.0900 0.0831 0.1096 0.1048 0.0946 0.1006 0.1096 0.1088 0.1061 0.1132 0.1192 0.1197 0.1252 0.1131 0.0882 0.0455 0.1051 0.0865 0.1831 0.1710 0.1400 0.1502 0.1654 0.1421 0.1390
va: 1.1989 1.9734 2.0711 3.1135 3.2301 3.1118 4.1172 3.9225 3.8792 3.7168 3.9380 3.9474 3.9268 3.8976 4.2436 3.8778 3.5547 3.9245 4.0583 3.9382 3.9584 4.0087 3.9765 3.9683 3.8419 1.0044 0.9935 1.0185 1.0261 1.0038 1.0198 1.0101 0.9957 1.0001 1.0030 1.0003 0.9953 1.0064 1.0251 1.0205 1.0027 1.0094 0.9965 0.9882 1.0021 0.9962 0.9996 1.0040 1.0087
dispcorr: -0.031474225 hartree
energy: -1513.551961944051
dipole: 35.09851 -32.09064 3.00787 9.24206 -8.06875 1.17331 -2.93226 3.00052 0.06826
magnitude: 3.22933 au
magnitude: 8.20832 debye
