program: Orca
programVersion: 4.2.1
elementType: Cl O O N N N C C C C C C C C C C C C C C C C C C C H H H H H H H H H H H H H H H H H H H H H H H H
charge: 0
multiplicity: 1
keywords: wb97x-d3
keywords: def2-TZVPP
keywords: def2/J RIJCOSX GRIDX6 NOFINALGRIDX
keywords: grid4 nofinalgrid
keywords: scfconv7
keywords: smallprint printgap noloewdin
keywords: NOSOSCF
formula: C19H24ClN3O2
InChI: InChI=1S/C19H24ClN3O2/c1-18(2)13-25-19(3,23(18)17(24)22-12-11-21-14-22)10-4-5-15-6-8-16(20)9-7-15/h6-9,11-12,14H,4-5,10,13H2,1-3H3
49 atoms
Cl -4.907428 5.040804 0.661323
O  1.582378 1.214813 0.591547
O  0.70564 -2.791276 1.038969
N  1.856316 -1.005849 0.250493
N  2.505277 -3.199578 -0.287099
N  4.199218 -4.567716 -0.602067
C  1.065537 -0.019891 1.035637
C  2.826231 -0.321496 -0.639027
C  2.166243 1.055445 -0.675925
C  -0.449722 -0.088109 0.788123
C  1.359442 -0.125834 2.524941
C  4.21193 -0.22001 -0.007241
C  2.907577 -0.877782 -2.05344
C  -0.918968 -0.250167 -0.651428
C  1.612786 -2.310752 0.393431
C  -2.447493 -0.270346 -0.766288
C  -3.083083 1.043548 -0.40731
C  2.14911 -4.024709 -1.324772
C  3.741908 -3.58883 0.123387
C  -3.044004 2.112583 -1.300768
C  -3.697841 1.243426 0.825235
C  3.218693 -4.843606 -1.515359
C  -3.599134 3.341968 -0.982513
C  -4.259534 2.466636 1.164171
C  -4.204787 3.508398 0.25356
H  2.890774 1.854633 -0.835547
H  1.424077 1.109809 -1.480281
H  -0.850284 0.840761 1.2048
H  -0.874152 -0.892111 1.389715
H  0.974457 -1.052165 2.945541
H  0.88017 0.69909 3.053787
H  2.431222 -0.077111 2.719265
H  4.700396 -1.189421 0.068093
H  4.176444 0.22151 0.989061
H  4.850828 0.410373 -0.627294
H  3.537519 -1.761025 -2.135139
H  1.921216 -1.109597 -2.457227
H  3.35099 -0.115559 -2.69705
H  -0.538528 0.552356 -1.286488
H  -0.541879 -1.185501 -1.071962
H  -2.850906 -1.06431 -0.132803
H  -2.712326 -0.530706 -1.79389
H  1.203794 -3.939388 -1.834252
H  4.237385 -3.142032 0.971013
H  -2.576521 1.987937 -2.270697
H  -3.74535 0.431043 1.540539
H  3.33418 -5.614821 -2.260685
H  -3.562751 4.157146 -1.692871
H  -4.734732 2.599594 2.126833
elementType: Cl O N C H
totalener: -1513.52039341 hartree
nucrepener: 2386.62097933 hartree
electener: -3900.14137273 hartree
oneelecener: -6809.96591180 hartree
twoeener: 2909.82453907 hartree
cpcmener: -0.03202126 hartree
kineticenergy: 1508.15612860 hartree
xcener: -124.305944157496 hartree
chargesum: -0.0000000
charge: -0.105655 -0.379722 -0.448013 -0.066641 -0.023659 -0.371598 0.336736 0.146257 0.025601 -0.225809 -0.310192 -0.344141 -0.334604 -0.123989 0.316544 -0.105871 0.042978 -0.134145 0.024422 -0.218938 -0.214485 -0.121979 -0.150007 -0.127724 0.080171 0.112473 0.085393 0.095846 0.088373 0.102448 0.113311 0.105098 0.113975 0.114888 0.108570 0.105286 0.109876 0.123080 0.087461 0.083452 0.093131 0.103705 0.179044 0.176799 0.140839 0.141337 0.164429 0.142586 0.143062
qa: -0.1057 -0.3797 -0.4480 -0.0666 -0.0237 -0.3716 0.3367 0.1463 0.0256 -0.2258 -0.3102 -0.3441 -0.3346 -0.1240 0.3165 -0.1059 0.0430 -0.1341 0.0244 -0.2189 -0.2145 -0.1220 -0.1500 -0.1277 0.0802 0.1125 0.0854 0.0958 0.0884 0.1024 0.1133 0.1051 0.1140 0.1149 0.1086 0.1053 0.1099 0.1231 0.0875 0.0835 0.0931 0.1037 0.1790 0.1768 0.1408 0.1413 0.1644 0.1426 0.1431
va: 1.1996 1.9758 2.0563 3.1239 3.2499 3.1103 4.0135 3.8792 3.9610 3.8195 3.9470 3.9573 3.9377 3.8959 4.2976 3.8599 3.5483 3.9040 4.0477 3.9893 3.9458 4.0146 3.9824 3.9659 3.8342 0.9938 0.9893 1.0271 1.0304 1.0135 1.0027 1.0041 1.0014 1.0034 1.0025 0.9946 1.0000 1.0041 1.0024 1.0172 1.0086 1.0039 0.9939 0.9887 1.0032 1.0031 1.0017 1.0049 1.0043
dispcorr: -0.029211467 hartree
energy: -1513.549604872329
dipole: 22.88457 -22.49391 0.39067 -13.09002 14.14292 1.05290 -5.87646 4.60738 -1.26908
magnitude: 1.69464 au
magnitude: 4.30743 debye
