program: Orca
programVersion: 4.2.1
elementType: Cl O O N N N C C C C C C C C C C C C C C C C C C C H H H H H H H H H H H H H H H H H H H H H H H H
charge: 0
multiplicity: 1
keywords: wb97x-d3
keywords: def2-TZVPP
keywords: def2/J RIJCOSX GRIDX6 NOFINALGRIDX
keywords: grid4 nofinalgrid
keywords: scfconv7
keywords: smallprint printgap noloewdin
keywords: NOSOSCF
formula: C19H24ClN3O2
InChI: InChI=1S/C19H24ClN3O2/c1-18(2)13-25-19(3,23(18)17(24)22-12-11-21-14-22)10-4-5-15-6-8-16(20)9-7-15/h6-9,11-12,14H,4-5,10,13H2,1-3H3
49 atoms
Cl -6.319777 1.81105 -1.809245
O  2.915843 1.656457 -0.094681
O  1.911999 -1.491249 2.379365
N  2.437458 -0.483292 0.415488
N  1.805497 -2.742482 0.487177
N  0.64872 -4.298296 -0.5545
C  2.577184 0.871704 1.021601
C  2.978455 -0.497513 -0.970278
C  3.693684 0.857255 -0.948344
C  1.271394 1.412152 1.598485
C  3.69866 0.925089 2.05646
C  3.986612 -1.605972 -1.238226
C  1.888421 -0.483524 -2.03629
C  0.0688 1.346739 0.667871
C  2.065438 -1.516134 1.176566
C  -1.161919 1.961205 1.319413
C  -2.431109 1.900193 0.508113
C  2.46082 -3.928213 0.711646
C  0.707916 -3.032077 -0.262486
C  -3.641309 2.245251 1.111622
C  -2.460711 1.524525 -0.831108
C  1.743818 -4.866997 0.037287
C  -4.836329 2.222764 0.413128
C  -3.649306 1.494425 -1.550212
C  -4.830009 1.845275 -0.921617
H  4.723568 0.753984 -0.583043
H  3.732842 1.320648 -1.934097
H  1.463009 2.453537 1.875646
H  1.050415 0.892019 2.53133
H  4.63664 0.530382 1.663481
H  3.453188 0.365405 2.954847
H  3.866604 1.963337 2.345689
H  3.521808 -2.568408 -1.443279
H  4.689569 -1.725741 -0.412781
H  4.566662 -1.342614 -2.124937
H  1.342367 -1.422836 -2.086966
H  1.172817 0.323253 -1.878865
H  2.345316 -0.332909 -3.015513
H  0.295809 1.869911 -0.263634
H  -0.147069 0.307312 0.404484
H  -0.95515 3.009086 1.561637
H  -1.343589 1.471135 2.280868
H  3.367316 -3.986597 1.290419
H  -0.022182 -2.28374 -0.529299
H  -3.654344 2.538784 2.154876
H  -1.551196 1.245878 -1.346847
H  1.958548 -5.920266 -0.053319
H  -5.760079 2.494528 0.906167
H  -3.643943 1.198168 -2.590664
elementType: Cl O N C H
totalener: -1513.52165233 hartree
nucrepener: 2381.85638105 hartree
electener: -3895.37803338 hartree
oneelecener: -6800.49982617 hartree
twoeener: 2905.12179279 hartree
cpcmener: -0.03157253 hartree
kineticenergy: 1508.15234485 hartree
xcener: -124.306375891192 hartree
chargesum: -0.0000000
charge: -0.106391 -0.381095 -0.449449 -0.050779 -0.021400 -0.377361 0.303465 0.095806 0.079615 -0.232708 -0.314321 -0.337085 -0.363200 -0.047067 0.340531 -0.107771 0.042270 -0.155047 0.036477 -0.205501 -0.194083 -0.110638 -0.170511 -0.188424 0.115023 0.082326 0.110970 0.100437 0.096632 0.100198 0.110107 0.109649 0.105847 0.112004 0.120667 0.120878 0.116234 0.115360 0.071257 0.065196 0.093527 0.088537 0.183957 0.169641 0.136961 0.142653 0.165058 0.142602 0.138945
qa: -0.1064 -0.3811 -0.4494 -0.0508 -0.0214 -0.3774 0.3035 0.0958 0.0796 -0.2327 -0.3143 -0.3371 -0.3632 -0.0471 0.3405 -0.1078 0.0423 -0.1550 0.0365 -0.2055 -0.1941 -0.1106 -0.1705 -0.1884 0.1150 0.0823 0.1110 0.1004 0.0966 0.1002 0.1101 0.1096 0.1058 0.1120 0.1207 0.1209 0.1162 0.1154 0.0713 0.0652 0.0935 0.0885 0.1840 0.1696 0.1370 0.1427 0.1651 0.1426 0.1389
va: 1.1990 1.9823 2.0630 3.1332 3.2443 3.1109 4.0263 3.9229 3.8922 3.7953 3.9447 3.9465 3.9390 3.8661 4.2671 3.8767 3.6387 3.9172 4.0409 4.0140 3.9364 4.0113 3.9952 4.0642 3.8009 1.0044 0.9928 1.0194 1.0276 1.0044 1.0200 1.0079 0.9944 1.0006 1.0031 0.9995 0.9971 1.0046 1.0148 1.0107 0.9995 1.0013 0.9938 0.9919 1.0042 1.0019 1.0006 1.0056 1.0093
dispcorr: -0.028583898 hartree
energy: -1513.550236226689
dipole: 35.85159 -33.13789 2.71370 0.67808 0.69164 1.36972 3.98329 -4.35563 -0.37234
magnitude: 3.06251 au
magnitude: 7.78427 debye
