program: Orca
programVersion: 4.2.1
elementType: Cl O O N N N C C C C C C C C C C C C C C C C C C C H H H H H H H H H H H H H H H H H H H H H H H H
charge: 0
multiplicity: 1
keywords: wb97x-d3
keywords: def2-TZVPP
keywords: def2/J RIJCOSX GRIDX6 NOFINALGRIDX
keywords: grid4 nofinalgrid
keywords: scfconv7
keywords: smallprint printgap noloewdin
keywords: NOSOSCF
formula: C19H24ClN3O2
InChI: InChI=1S/C19H24ClN3O2/c1-18(2)13-25-19(3,23(18)17(24)22-12-11-21-14-22)10-4-5-15-6-8-16(20)9-7-15/h6-9,11-12,14H,4-5,10,13H2,1-3H3
49 atoms
Cl -5.984749 2.30466 -1.992032
O  2.905811 1.570912 0.12431
O  1.564211 -1.712044 2.248987
N  2.286296 -0.590806 0.415131
N  1.795002 -2.888421 0.319995
N  0.855253 -4.655038 -0.592837
C  2.481072 0.693964 1.143726
C  2.640912 -0.442804 -1.018071
C  2.509077 1.074012 -1.128939
C  1.198823 1.217089 1.80294
C  3.608405 0.603939 2.161459
C  4.081513 -0.867552 -1.287933
C  1.682554 -1.100028 -2.000728
C  -0.027667 1.334343 0.907797
C  1.8784 -1.675657 1.078635
C  -1.277946 1.69386 1.713848
C  -2.479777 1.853943 0.827882
C  2.813445 -3.764388 0.037358
C  0.637237 -3.486864 -0.061314
C  -3.247672 0.752338 0.458088
C  -2.823335 3.098017 0.305621
C  2.207984 -4.843097 -0.532209
C  -4.324967 0.879959 -0.405917
C  -3.897468 3.247653 -0.559212
C  -4.640219 2.131893 -0.909731
H  3.165892 1.486246 -1.896146
H  1.480212 1.359021 -1.376725
H  1.44435 2.204884 2.204709
H  0.963054 0.594344 2.665702
H  3.341132 -0.02307 3.00876
H  3.832737 1.599634 2.54629
H  4.516082 0.20396 1.708466
H  4.22788 -1.935214 -1.137027
H  4.789933 -0.333747 -0.653871
H  4.338683 -0.652392 -2.326091
H  0.639762 -0.946592 -1.720727
H  1.824895 -0.634409 -2.977912
H  1.863914 -2.164559 -2.134911
H  0.126927 2.099934 0.14355
H  -0.213223 0.396174 0.375915
H  -1.100017 2.6195 2.26745
H  -1.463389 0.915154 2.458422
H  3.840312 -3.566371 0.292834
H  -0.323368 -3.010354 0.061512
H  -3.007557 -0.228571 0.851518
H  -2.245379 3.973515 0.577164
H  2.676831 -5.745636 -0.8920
H  -4.910013 0.011895 -0.6787
H  -4.14893 4.223959 -0.951482
elementType: Cl O N C H
totalener: -1513.52170995 hartree
nucrepener: 2387.53749799 hartree
electener: -3901.05920794 hartree
oneelecener: -6811.68556236 hartree
twoeener: 2910.62635443 hartree
cpcmener: -0.03175094 hartree
kineticenergy: 1508.15774223 hartree
xcener: -124.305269747532 hartree
chargesum: -0.0000000
charge: -0.105783 -0.384360 -0.447598 -0.071539 -0.019215 -0.370092 0.364178 0.137907 0.024988 -0.261950 -0.311931 -0.346549 -0.334027 -0.128948 0.325800 -0.058247 0.029953 -0.150119 0.038529 -0.225001 -0.213266 -0.129303 -0.144604 -0.146299 0.085088 0.115737 0.085750 0.099933 0.094284 0.104052 0.112889 0.104996 0.114881 0.113978 0.108884 0.107726 0.124460 0.106377 0.096839 0.073735 0.087663 0.094265 0.192252 0.169885 0.143286 0.140675 0.164568 0.142841 0.142436
qa: -0.1058 -0.3844 -0.4476 -0.0715 -0.0192 -0.3701 0.3642 0.1379 0.0250 -0.2619 -0.3119 -0.3465 -0.3340 -0.1289 0.3258 -0.0582 0.0300 -0.1501 0.0385 -0.2250 -0.2133 -0.1293 -0.1446 -0.1463 0.0851 0.1157 0.0858 0.0999 0.0943 0.1041 0.1129 0.1050 0.1149 0.1140 0.1089 0.1077 0.1245 0.1064 0.0968 0.0737 0.0877 0.0943 0.1923 0.1699 0.1433 0.1407 0.1646 0.1428 0.1424
va: 1.1994 1.9813 2.0592 3.1393 3.2411 3.1160 3.9460 3.8840 3.9605 3.8502 3.9459 3.9629 3.9456 3.8697 4.2859 3.7929 3.5874 3.9103 4.0407 3.9776 3.9805 4.0380 3.9776 3.9723 3.8265 0.9951 0.9871 1.0169 1.0324 1.0147 1.0047 1.0036 1.0020 1.0036 1.0023 1.0004 1.0039 0.9952 1.0099 1.0171 1.0119 1.0083 0.9793 0.9994 1.0036 1.0036 1.0027 1.0053 1.0051
dispcorr: -0.028630533 hartree
energy: -1513.550340479566
dipole: 32.74989 -30.73156 2.01833 -0.65734 2.25058 1.59324 4.84769 -5.39745 -0.54977
magnitude: 2.62951 au
magnitude: 6.68369 debye
