program: Orca
programVersion: 4.2.1
elementType: Cl O O N N N C C C C C C C C C C C C C C C C C C C H H H H H H H H H H H H H H H H H H H H H H H H
charge: 0
multiplicity: 1
keywords: wb97x-d3
keywords: def2-TZVPP
keywords: def2/J RIJCOSX GRIDX6 NOFINALGRIDX
keywords: grid4 nofinalgrid
keywords: scfconv7
keywords: smallprint printgap noloewdin
keywords: NOSOSCF
formula: C19H24ClN3O2
InChI: InChI=1S/C19H24ClN3O2/c1-18(2)13-25-19(3,23(18)17(24)22-12-11-21-14-22)10-4-5-15-6-8-16(20)9-7-15/h6-9,11-12,14H,4-5,10,13H2,1-3H3
49 atoms
Cl -6.072293 1.960335 -2.034818
O  2.917394 1.545629 -0.258827
O  1.65312 -1.342069 2.415516
N  2.29936 -0.535457 0.397313
N  1.774632 -2.809534 0.686132
N  0.762126 -4.672573 0.103077
C  2.536723 0.844992 0.904718
C  2.604343 -0.62305 -1.05227
C  2.473759 0.857051 -1.400807
C  1.291215 1.483068 1.532088
C  3.709893 0.901171 1.87236
C  4.034386 -1.096498 -1.297864
C  1.613179 -1.422766 -1.885452
C  0.025712 1.478251 0.685562
C  1.912519 -1.495488 1.24117
C  -1.176696 2.007044 1.471489
C  -2.423232 2.013518 0.634059
C  2.763685 -3.741224 0.491818
C  0.589593 -3.43221 0.45852
C  -2.798635 3.143114 -0.087828
C  -3.204616 0.866931 0.511614
C  2.11319 -4.879796 0.124165
C  -3.917241 3.137815 -0.90854
C  -4.325825 0.840048 -0.303965
C  -4.672185 1.980788 -1.01073
H  3.10268 1.134706 -2.247422
H  1.437786 1.107286 -1.655993
H  1.563136 2.5174 1.76399
H  1.090313 1.005384 2.490737
H  4.590381 0.413177 1.453792
H  3.473876 0.42835 2.82283
H  3.964648 1.941969 2.076014
H  4.765753 -0.469839 -0.786773
H  4.254817 -1.058338 -2.365674
H  4.186228 -2.125154 -0.976257
H  1.790674 -2.496151 -1.856591
H  0.580192 -1.222692 -1.599367
H  1.722299 -1.117576 -2.928057
H  0.158406 2.096274 -0.205627
H  -0.204826 0.467359 0.335539
H  -0.962552 3.017739 1.828544
H  -1.328285 1.387043 2.359017
H  3.805404 -3.528588 0.66014
H  -0.355937 -2.919795 0.552765
H  -2.2115 4.050653 -0.011082
H  -2.939918 -0.027094 1.064179
H  2.549196 -5.837043 -0.116276
H  -4.193308 4.027714 -1.45824
H  -4.92038 -0.060278 -0.383045
elementType: Cl O N C H
totalener: -1513.52194338 hartree
nucrepener: 2387.99980015 hartree
electener: -3901.52174353 hartree
oneelecener: -6812.61069168 hartree
twoeener: 2911.08894815 hartree
cpcmener: -0.03191012 hartree
kineticenergy: 1508.15410360 hartree
xcener: -124.304700841282 hartree
chargesum: -0.0000000
charge: -0.105639 -0.384429 -0.447494 -0.071332 -0.018221 -0.370422 0.360370 0.140590 0.023353 -0.259960 -0.310711 -0.345332 -0.332590 -0.129729 0.324579 -0.061374 0.030147 -0.151668 0.039705 -0.212119 -0.224205 -0.129400 -0.145957 -0.145335 0.084882 0.115518 0.084390 0.099943 0.093761 0.104850 0.104655 0.113190 0.114335 0.109008 0.113934 0.106187 0.107115 0.124225 0.096620 0.074756 0.089022 0.094662 0.193290 0.169635 0.140080 0.143262 0.164657 0.142743 0.142450
qa: -0.1056 -0.3844 -0.4475 -0.0713 -0.0182 -0.3704 0.3604 0.1406 0.0234 -0.2600 -0.3107 -0.3453 -0.3326 -0.1297 0.3246 -0.0614 0.0301 -0.1517 0.0397 -0.2121 -0.2242 -0.1294 -0.1460 -0.1453 0.0849 0.1155 0.0844 0.0999 0.0938 0.1048 0.1047 0.1132 0.1143 0.1090 0.1139 0.1062 0.1071 0.1242 0.0966 0.0748 0.0890 0.0947 0.1933 0.1696 0.1401 0.1433 0.1647 0.1427 0.1425
va: 1.1996 1.9804 2.0596 3.1377 3.2411 3.1163 3.9480 3.8788 3.9628 3.8478 3.9459 3.9646 3.9443 3.8719 4.2875 3.7936 3.5844 3.9102 4.0397 3.9801 3.9743 4.0366 3.9709 3.9774 3.8256 0.9950 0.9874 1.0168 1.0335 1.0032 1.0142 1.0049 1.0036 1.0023 1.0020 0.9957 1.0004 1.0040 1.0106 1.0165 1.0117 1.0082 0.9791 0.9994 1.0040 1.0034 1.0027 1.0051 1.0052
dispcorr: -0.028621957 hartree
energy: -1513.550565339414
dipole: 33.17452 -31.13123 2.04329 0.03237 1.43062 1.46300 3.32564 -4.21416 -0.88852
magnitude: 2.66550 au
magnitude: 6.77515 debye
