program: Orca
programVersion: 4.2.1
elementType: Cl O O N N N C C C C C C C C C C C C C C C C C C C H H H H H H H H H H H H H H H H H H H H H H H H
charge: 0
multiplicity: 1
keywords: wb97x-d3
keywords: def2-TZVPP
keywords: def2/J RIJCOSX GRIDX6 NOFINALGRIDX
keywords: grid4 nofinalgrid
keywords: scfconv7
keywords: smallprint printgap noloewdin
keywords: NOSOSCF
formula: C19H24ClN3O2
InChI: InChI=1S/C19H24ClN3O2/c1-18(2)13-25-19(3,23(18)17(24)22-12-11-21-14-22)10-4-5-15-6-8-16(20)9-7-15/h6-9,11-12,14H,4-5,10,13H2,1-3H3
49 atoms
Cl -6.037262 1.824679 -2.036459
O  2.992383 1.555898 -0.229278
O  1.588115 -1.302145 2.404914
N  2.307484 -0.51074 0.405775
N  1.707907 -2.768444 0.674615
N  0.659132 -4.601905 0.062474
C  2.57296 0.860735 0.923894
C  2.622035 -0.5997 -1.042291
C  2.553358 0.887276 -1.383937
C  1.333815 1.528822 1.533585
C  3.732467 0.881562 1.908406
C  4.031895 -1.131257 -1.280023
C  1.604951 -1.349678 -1.889625
C  0.07014 1.517115 0.684076
C  1.870873 -1.460057 1.236419
C  -1.132189 2.074486 1.449909
C  -2.381262 2.034538 0.616631
C  2.675751 -3.725405 0.499129
C  0.512254 -3.358349 0.419242
C  -2.762913 3.122507 -0.163717
C  -3.158871 0.880483 0.557341
C  2.0029 -4.845521 0.114263
C  -3.883299 3.06901 -0.980125
C  -4.282039 0.805558 -0.252619
C  -4.634402 1.905421 -1.01841
H  3.215215 1.144116 -2.212849
H  1.534226 1.177364 -1.665806
H  1.619102 2.564912 1.740894
H  1.125176 1.077731 2.503196
H  3.4807 0.391634 2.845882
H  3.996725 1.914868 2.138079
H  4.612719 0.393344 1.489124
H  4.784326 -0.543124 -0.754227
H  4.264165 -1.088815 -2.345182
H  4.136101 -2.169664 -0.97241
H  1.731657 -2.429954 -1.866517
H  0.57955 -1.102114 -1.613965
H  1.73994 -1.043365 -2.929107
H  0.211485 2.109694 -0.222947
H  -0.169396 0.500267 0.35842
H  -0.923655 3.10112 1.76197
H  -1.278768 1.493057 2.364188
H  3.718673 -3.539459 0.690279
H  -0.420631 -2.821133 0.49537
H  -2.179218 4.035085 -0.137727
H  -2.88968 0.017973 1.155904
H  2.419138 -5.812821 -0.119822
H  -4.16349 3.927249 -1.576087
H  -4.872645 -0.100313 -0.28095
elementType: Cl O N C H
totalener: -1513.52170771 hartree
nucrepener: 2392.68127775 hartree
electener: -3906.20298546 hartree
oneelecener: -6822.00815113 hartree
twoeener: 2915.80516567 hartree
cpcmener: -0.03166096 hartree
kineticenergy: 1508.15472406 hartree
xcener: -124.304790524868 hartree
chargesum: -0.0000000
charge: -0.105563 -0.382566 -0.447770 -0.067311 -0.016481 -0.370280 0.353853 0.137409 0.028581 -0.252416 -0.311402 -0.342749 -0.334587 -0.129622 0.319002 -0.063048 0.035614 -0.150521 0.040721 -0.212802 -0.226480 -0.129185 -0.145148 -0.143821 0.083842 0.114513 0.082732 0.099245 0.092925 0.104085 0.113141 0.104999 0.114344 0.108395 0.114078 0.105664 0.108111 0.124438 0.099563 0.069492 0.089729 0.094507 0.193657 0.167131 0.140314 0.141748 0.164452 0.142387 0.143079
qa: -0.1056 -0.3826 -0.4478 -0.0673 -0.0165 -0.3703 0.3539 0.1374 0.0286 -0.2524 -0.3114 -0.3427 -0.3346 -0.1296 0.3190 -0.0630 0.0356 -0.1505 0.0407 -0.2128 -0.2265 -0.1292 -0.1451 -0.1438 0.0838 0.1145 0.0827 0.0992 0.0929 0.1041 0.1131 0.1050 0.1143 0.1084 0.1141 0.1057 0.1081 0.1244 0.0996 0.0695 0.0897 0.0945 0.1937 0.1671 0.1403 0.1417 0.1645 0.1424 0.1431
va: 1.1998 1.9822 2.0577 3.1329 3.2393 3.1166 3.9564 3.8818 3.9593 3.8478 3.9464 3.9628 3.9466 3.8770 4.2900 3.7975 3.5796 3.9085 4.0407 3.9809 3.9755 4.0369 3.9713 3.9774 3.8284 0.9945 0.9876 1.0180 1.0332 1.0145 1.0040 1.0039 1.0033 1.0022 1.0021 0.9961 0.9994 1.0038 1.0100 1.0168 1.0116 1.0083 0.9786 1.0006 1.0039 1.0040 1.0027 1.0051 1.0048
dispcorr: -0.028738847 hartree
energy: -1513.550446561009
dipole: 33.34710 -31.22862 2.11848 0.58232 0.89996 1.48228 3.40827 -4.27704 -0.86877
magnitude: 2.72761 au
magnitude: 6.93304 debye
