program: Orca
programVersion: 4.2.1
elementType: Cl O O N N N C C C C C C C C C C C C C C C C C C C H H H H H H H H H H H H H H H H H H H H H H H H
charge: 0
multiplicity: 1
keywords: wb97x-d3
keywords: def2-TZVPP
keywords: def2/J RIJCOSX GRIDX6 NOFINALGRIDX
keywords: grid4 nofinalgrid
keywords: scfconv7
keywords: smallprint printgap noloewdin
keywords: NOSOSCF
formula: C19H24ClN3O2
InChI: InChI=1S/C19H24ClN3O2/c1-18(2)13-25-19(3,23(18)17(24)22-12-11-21-14-22)10-4-5-15-6-8-16(20)9-7-15/h6-9,11-12,14H,4-5,10,13H2,1-3H3
49 atoms
Cl -5.852254 1.807245 -2.039447
O  3.184025 1.551006 0.207402
O  1.280722 -1.512257 2.214456
N  2.301205 -0.522147 0.448861
N  1.479506 -2.720286 0.301664
N  1.805873 -4.727001 -0.537009
C  2.605526 0.72945 1.195812
C  2.726972 -0.409731 -0.96794
C  2.789152 1.113458 -1.067588
C  1.358974 1.399582 1.794439
C  3.657463 0.503699 2.271864
C  4.114385 -1.006073 -1.18696
C  1.73184 -0.934634 -1.993575
C  0.140714 1.509672 0.887092
C  1.688542 -1.531722 1.07296
C  -1.09443 2.00287 1.644838
C  -2.312527 1.98025 0.766951
C  0.251411 -3.171173 -0.113321
C  2.375039 -3.707735 0.039469
C  -3.043925 0.805259 0.606924
C  -2.704069 3.100824 0.040629
C  0.482234 -4.402132 -0.645174
C  -4.131461 0.741301 -0.250243
C  -3.790201 3.058383 -0.822048
C  -4.494882 1.873986 -0.961667
H  3.527794 1.444643 -1.798644
H  1.816804 1.526142 -1.360615
H  1.673958 2.399831 2.105923
H  1.080653 0.874835 2.707836
H  3.282376 -0.124286 3.076805
H  3.947344 1.46073 2.707965
H  4.550172 0.036298 1.855541
H  4.437829 -0.81562 -2.211204
H  4.127051 -2.084811 -1.044056
H  4.855481 -0.568084 -0.517815
H  1.775075 -2.012764 -2.132225
H  0.707062 -0.651484 -1.750647
H  1.970334 -0.485152 -2.959416
H  0.334664 2.189502 0.053976
H  -0.098267 0.539283 0.443119
H  -0.917774 3.013353 2.02129
H  -1.257442 1.365831 2.518197
H  -0.647189 -2.585077 -0.015983
H  3.413475 -3.633548 0.320276
H  -2.765018 -0.082408 1.163039
H  -2.155658 4.029464 0.145015
H  -0.234821 -5.068257 -1.09879
H  -4.686757 -0.180835 -0.358014
H  -4.079972 3.9410 -1.37624
elementType: Cl O N C H
totalener: -1513.52112138 hartree
nucrepener: 2406.27280579 hartree
electener: -3919.79392717 hartree
oneelecener: -6849.11222460 hartree
twoeener: 2929.31829743 hartree
cpcmener: -0.03101804 hartree
kineticenergy: 1508.15978968 hartree
xcener: -124.305923977933 hartree
chargesum: 0.0000000
charge: -0.105348 -0.380335 -0.445787 -0.063425 -0.009628 -0.370001 0.351065 0.122113 0.031594 -0.252861 -0.312539 -0.336484 -0.325805 -0.124346 0.307047 -0.065751 0.044057 -0.133297 0.021228 -0.234205 -0.212709 -0.125740 -0.138914 -0.144874 0.082071 0.113834 0.084452 0.099682 0.091785 0.104821 0.112480 0.104794 0.108480 0.112655 0.113422 0.106451 0.107269 0.124245 0.103928 0.060246 0.090679 0.095077 0.177213 0.178567 0.140294 0.140754 0.165738 0.143252 0.142756
qa: -0.1053 -0.3803 -0.4458 -0.0634 -0.0096 -0.3700 0.3511 0.1221 0.0316 -0.2529 -0.3125 -0.3365 -0.3258 -0.1243 0.3070 -0.0658 0.0441 -0.1333 0.0212 -0.2342 -0.2127 -0.1257 -0.1389 -0.1449 0.0821 0.1138 0.0845 0.0997 0.0918 0.1048 0.1125 0.1048 0.1085 0.1127 0.1134 0.1065 0.1073 0.1242 0.1039 0.0602 0.0907 0.0951 0.1772 0.1786 0.1403 0.1408 0.1657 0.1433 0.1428
va: 1.1999 1.9828 2.0562 3.1218 3.2353 3.1141 3.9529 3.9062 3.9588 3.8679 3.9470 3.9588 3.9354 3.8790 4.2921 3.8029 3.5779 3.9022 4.0488 3.9772 3.9829 4.0221 3.9740 3.9693 3.8299 0.9936 0.9890 1.0194 1.0299 1.0134 1.0032 1.0045 1.0020 1.0021 1.0037 0.9960 0.9996 1.0042 1.0084 1.0142 1.0121 1.0081 0.9930 0.9891 1.0053 1.0040 1.0016 1.0047 1.0051
dispcorr: -0.029088819 hartree
energy: -1513.550210200209
dipole: 31.36058 -30.17602 1.18456 1.68954 0.18203 1.87158 5.13161 -5.74368 -0.61206
magnitude: 2.29795 au
magnitude: 5.84094 debye
