program: Orca
programVersion: 4.2.1
elementType: Cl O O N N N C C C C C C C C C C C C C C C C C C C H H H H H H H H H H H H H H H H H H H H H H H H
charge: 0
multiplicity: 1
keywords: wb97x-d3
keywords: def2-TZVPP
keywords: def2/J RIJCOSX GRIDX6 NOFINALGRIDX
keywords: grid4 nofinalgrid
keywords: scfconv7
keywords: smallprint printgap noloewdin
keywords: NOSOSCF
formula: C19H24ClN3O2
InChI: InChI=1S/C19H24ClN3O2/c1-18(2)13-25-19(3,23(18)17(24)22-12-11-21-14-22)10-4-5-15-6-8-16(20)9-7-15/h6-9,11-12,14H,4-5,10,13H2,1-3H3
49 atoms
Cl -5.412623 4.491198 1.130208
O  1.787399 1.309327 0.577175
O  0.602285 -2.639312 0.898794
N  1.934621 -0.927896 0.236077
N  2.471137 -3.157239 -0.283282
N  3.09818 -4.753975 -1.659392
C  1.132693 0.113306 0.938095
C  3.085129 -0.316128 -0.474194
C  2.548747 1.10878 -0.586008
C  -0.337284 0.156446 0.504166
C  1.233946 -0.022885 2.450415
C  4.350795 -0.334453 0.378389
C  3.358519 -0.858624 -1.869283
C  -0.608144 0.247921 -0.991205
C  1.591073 -2.21394 0.340548
C  -2.096976 0.099008 -1.323345
C  -2.94896 1.181196 -0.721438
C  3.632056 -3.676962 0.232711
C  2.186573 -3.858483 -1.410615
C  -2.96993 2.458287 -1.278946
C  -3.711153 0.95401 0.420733
C  4.003562 -4.654082 -0.6403
C  -3.722185 3.479493 -0.719712
C  -4.470305 1.962623 0.997593
C  -4.467533 3.221146 0.420346
H  3.35239 1.845817 -0.612655
H  1.950492 1.230034 -1.496213
H  -0.768331 1.026693 1.007281
H  -0.853663 -0.710759 0.915383
H  0.713425 -0.906385 2.812632
H  0.777194 0.845798 2.926353
H  2.273809 -0.078228 2.772713
H  4.719098 -1.344677 0.544563
H  4.195833 0.135696 1.349724
H  5.143033 0.214216 -0.132819
H  3.932698 -1.782962 -1.870585
H  2.441026 -1.007035 -2.439325
H  3.957143 -0.121526 -2.408227
H  -0.253368 1.202261 -1.388545
H  -0.068663 -0.535152 -1.531109
H  -2.446322 -0.87839 -0.980778
H  -2.212366 0.10614 -2.409922
H  4.05793 -3.341725 1.162988
H  1.311702 -3.653609 -2.008416
H  -2.392933 2.666222 -2.172505
H  -3.720139 -0.029341 0.87533
H  4.869373 -5.294635 -0.577619
H  -3.72759 4.462289 -1.171809
H  -5.055483 1.762818 1.885217
elementType: Cl O N C H
totalener: -1513.52097494 hartree
nucrepener: 2383.09134374 hartree
electener: -3896.61231868 hartree
oneelecener: -6802.91791857 hartree
twoeener: 2906.30559990 hartree
cpcmener: -0.03222249 hartree
kineticenergy: 1508.15615080 hartree
xcener: -124.306569212778 hartree
chargesum: -0.0000000
charge: -0.105836 -0.383232 -0.450353 -0.069666 -0.021505 -0.369627 0.349892 0.142627 0.026719 -0.236079 -0.310185 -0.348234 -0.333650 -0.128118 0.328624 -0.113918 0.032556 -0.149874 0.038906 -0.206324 -0.197621 -0.129930 -0.153316 -0.139956 0.086882 0.113874 0.084546 0.093777 0.092156 0.103469 0.112237 0.106008 0.114641 0.114773 0.108821 0.105476 0.107991 0.124240 0.088041 0.086373 0.091299 0.102476 0.191512 0.170375 0.139866 0.139536 0.163868 0.143036 0.142830
qa: -0.1058 -0.3832 -0.4504 -0.0697 -0.0215 -0.3696 0.3499 0.1426 0.0267 -0.2361 -0.3102 -0.3482 -0.3336 -0.1281 0.3286 -0.1139 0.0326 -0.1499 0.0389 -0.2063 -0.1976 -0.1299 -0.1533 -0.1400 0.0869 0.1139 0.0845 0.0938 0.0922 0.1035 0.1122 0.1060 0.1146 0.1148 0.1088 0.1055 0.1080 0.1242 0.0880 0.0864 0.0913 0.1025 0.1915 0.1704 0.1399 0.1395 0.1639 0.1430 0.1428
va: 1.1994 1.9779 2.0563 3.1415 3.2442 3.1161 4.0182 3.8785 3.9628 3.8028 3.9451 3.9613 3.9458 3.8687 4.2906 3.8723 3.5624 3.9095 4.0397 3.9781 3.9422 4.0389 3.9829 3.9806 3.8270 0.9949 0.9877 1.0194 1.0345 1.0142 1.0049 1.0027 1.0021 1.0034 1.0024 0.9959 1.0002 1.0039 1.0045 1.0198 1.0088 1.0044 0.9799 0.9987 1.0032 1.0035 1.0029 1.0046 1.0046
dispcorr: -0.029134274 hartree
energy: -1513.550109214229
dipole: 28.43955 -26.80968 1.62988 -9.93425 11.28290 1.34865 -5.84027 5.42392 -0.41634
magnitude: 2.15608 au
magnitude: 5.48033 debye
