program: Orca
programVersion: 4.2.1
elementType: Cl O O N N N C C C C C C C C C C C C C C C C C C C H H H H H H H H H H H H H H H H H H H H H H H H
charge: 0
multiplicity: 1
keywords: wb97x-d3
keywords: def2-TZVPP
keywords: def2/J RIJCOSX GRIDX6 NOFINALGRIDX
keywords: grid4 nofinalgrid
keywords: scfconv7
keywords: smallprint printgap noloewdin
keywords: NOSOSCF
formula: C19H24ClN3O2
InChI: InChI=1S/C19H24ClN3O2/c1-18(2)13-25-19(3,23(18)17(24)22-12-11-21-14-22)10-4-5-15-6-8-16(20)9-7-15/h6-9,11-12,14H,4-5,10,13H2,1-3H3
49 atoms
Cl -5.573033 2.782078 -2.485463
O  2.91771 1.350185 0.770453
O  2.51746 -2.635925 -1.209929
N  2.3730 -0.671175 -0.088159
N  1.588264 -2.678855 0.862142
N  1.324044 -4.244959 2.385702
C  2.366937 0.117905 1.18069
C  2.916275 0.130402 -1.209722
C  2.754679 1.524611 -0.61558
C  0.971882 0.333381 1.776846
C  3.311337 -0.448428 2.232122
C  4.391357 -0.176644 -1.457923
C  2.099934 0.012833 -2.488566
C  -0.107647 0.830411 0.826028
C  2.209411 -1.990612 -0.232129
C  -1.486201 0.847013 1.490752
C  -2.544447 1.324346 0.537965
C  0.240252 -2.744688 1.122208
C  2.18571 -3.627218 1.631568
C  -2.826821 2.681384 0.404278
C  -3.222955 0.429216 -0.284773
C  0.104484 -3.710061 2.07143
C  -3.754635 3.138723 -0.519545
C  -4.154483 0.865447 -1.215229
C  -4.411348 2.222443 -1.325328
H  3.520659 2.214123 -0.974446
H  1.776298 1.952275 -0.863944
H  1.097068 1.053814 2.590842
H  0.640186 -0.587337 2.258837
H  4.275194 -0.716292 1.798335
H  2.900939 -1.320453 2.735153
H  3.485277 0.307542 2.999049
H  4.769716 0.469791 -2.251406
H  4.54619 -1.206534 -1.772333
H  4.996572 0.006108 -0.568585
H  1.029125 0.082335 -2.287552
H  2.362645 0.841187 -3.149704
H  2.291535 -0.910185 -3.030036
H  0.12177 1.841364 0.482029
H  -0.155056 0.203219 -0.069878
H  -1.457056 1.493065 2.371988
H  -1.732573 -0.156123 1.850793
H  -0.48054 -2.132431 0.606971
H  3.251036 -3.79647 1.605955
H  -2.31645 3.402153 1.032249
H  -3.028617 -0.633827 -0.203244
H  -0.806233 -4.047521 2.540862
H  -3.9607 4.197138 -0.605619
H  -4.671271 0.152371 -1.843464
elementType: Cl O N C H
totalener: -1513.51980552 hartree
nucrepener: 2404.53691455 hartree
electener: -3918.05672008 hartree
oneelecener: -6845.25271456 hartree
twoeener: 2927.19599448 hartree
cpcmener: -0.03147123 hartree
kineticenergy: 1508.15310866 hartree
xcener: -124.303598489177 hartree
chargesum: 0.0000000
charge: -0.104593 -0.375180 -0.445698 -0.091423 -0.033861 -0.371542 0.364471 0.172275 0.029111 -0.290101 -0.339360 -0.346673 -0.324469 -0.170695 0.360448 -0.077339 0.052316 -0.168994 0.027883 -0.219965 -0.220630 -0.114152 -0.143957 -0.146269 0.084214 0.112162 0.081794 0.111139 0.104730 0.117139 0.107396 0.116930 0.107723 0.108372 0.107189 0.102455 0.114675 0.108775 0.107708 0.083451 0.100785 0.093334 0.190319 0.181030 0.141599 0.142375 0.167645 0.142396 0.143061
qa: -0.1046 -0.3752 -0.4457 -0.0914 -0.0339 -0.3715 0.3645 0.1723 0.0291 -0.2901 -0.3394 -0.3467 -0.3245 -0.1707 0.3604 -0.0773 0.0523 -0.1690 0.0279 -0.2200 -0.2206 -0.1142 -0.1440 -0.1463 0.0842 0.1122 0.0818 0.1111 0.1047 0.1171 0.1074 0.1169 0.1077 0.1084 0.1072 0.1025 0.1147 0.1088 0.1077 0.0835 0.1008 0.0933 0.1903 0.1810 0.1416 0.1424 0.1676 0.1424 0.1431
va: 1.2007 1.9754 2.0631 3.1255 3.2619 3.1169 3.9414 3.8745 3.9632 3.8689 3.9751 3.9399 3.9142 3.8641 4.2630 3.7814 3.5459 3.9223 4.0299 3.9953 3.9798 4.0477 3.9739 3.9890 3.8291 0.9959 0.9872 1.0212 0.9964 0.9996 0.9968 1.0104 1.0010 1.0162 1.0041 0.9996 0.9991 1.0167 1.0128 1.0168 1.0132 1.0116 0.9808 0.9927 1.0036 1.0021 1.0024 1.0050 1.0057
dispcorr: -0.029517541 hartree
energy: -1513.549323065876
dipole: 28.74038 -28.09728 0.64309 -0.99252 3.15662 2.16410 8.18420 -7.98403 0.20017
magnitude: 2.26649 au
magnitude: 5.76095 debye
