program: Orca
programVersion: 4.2.1
elementType: Cl O O N N N C C C C C C C C C C C C C C C C C C C H H H H H H H H H H H H H H H H H H H H H H H H
charge: 0
multiplicity: 1
keywords: wb97x-d3
keywords: def2-TZVPP
keywords: def2/J RIJCOSX GRIDX6 NOFINALGRIDX
keywords: grid4 nofinalgrid
keywords: scfconv7
keywords: smallprint printgap noloewdin
keywords: NOSOSCF
formula: C19H24ClN3O2
InChI: InChI=1S/C19H24ClN3O2/c1-18(2)13-25-19(3,23(18)17(24)22-12-11-21-14-22)10-4-5-15-6-8-16(20)9-7-15/h6-9,11-12,14H,4-5,10,13H2,1-3H3
49 atoms
Cl -5.870167 2.668167 -2.273229
O  2.838416 1.403895 0.895053
O  1.986675 -2.216321 -1.517447
N  2.608219 -0.646559 -0.002748
N  1.422593 -2.56858 0.651762
N  1.215744 -4.04782 2.267596
C  2.432895 0.111814 1.275373
C  3.356668 0.168344 -0.991406
C  3.858703 1.271528 -0.063612
C  0.989587 0.217935 1.763697
C  3.344737 -0.398736 2.388535
C  4.524364 -0.579854 -1.616145
C  2.439301 0.761421 -2.059265
C  -0.021175 0.697458 0.731947
C  2.030409 -1.790613 -0.38297
C  -1.425967 0.728393 1.317047
C  -2.507512 1.224077 0.391179
C  0.096391 -2.927045 0.682025
C  2.051727 -3.293908 1.615175
C  -3.770674 1.509119 0.911198
C  -2.315327 1.401328 -0.975411
C  -0.009889 -3.819217 1.703104
C  -4.806975 1.950198 0.106108
C  -3.341658 1.843512 -1.800821
C  -4.58221 2.114348 -1.25283
H  4.818262 1.003853 0.396919
H  3.987048 2.223665 -0.578285
H  1.006909 0.916468 2.605839
H  0.671656 -0.734816 2.189472
H  4.355154 -0.607044 2.036277
H  2.961236 -1.30277 2.854449
H  3.407648 0.358608 3.170786
H  4.205844 -1.297413 -2.369165
H  5.110338 -1.106946 -0.861852
H  5.185864 0.136927 -2.106267
H  1.646259 1.36585 -1.617972
H  3.020896 1.411326 -2.715068
H  1.980612 -0.00488 -2.680106
H  0.252323 1.694241 0.378473
H  -0.007833 0.04423 -0.144941
H  -1.428087 1.349531 2.2178
H  -1.695101 -0.277331 1.658604
H  -0.631513 -2.515217 0.003147
H  3.118981 -3.250205 1.76516
H  -3.9523 1.385532 1.972514
H  -1.354452 1.197631 -1.429069
H  -0.901664 -4.31022 2.059869
H  -5.776462 2.165356 0.53513
H  -3.165415 1.97317 -2.860305
elementType: Cl O N C H
totalener: -1513.52126104 hartree
nucrepener: 2406.08926934 hartree
electener: -3919.61053037 hartree
oneelecener: -6848.73912101 hartree
twoeener: 2929.12859063 hartree
cpcmener: -0.03083007 hartree
kineticenergy: 1508.15205525 hartree
xcener: -124.306867807130 hartree
chargesum: 0.0000000
charge: -0.105809 -0.372854 -0.446455 -0.046964 -0.014189 -0.373281 0.244202 0.132472 0.072056 -0.194206 -0.323193 -0.323289 -0.359044 -0.103747 0.322489 -0.095994 0.046670 -0.150520 0.026748 -0.214866 -0.198342 -0.114422 -0.165271 -0.176423 0.109587 0.081609 0.110825 0.110835 0.096374 0.110410 0.118699 0.113875 0.107967 0.099490 0.115032 0.105887 0.112484 0.115104 0.103336 0.053421 0.095557 0.092866 0.176530 0.180543 0.137707 0.137907 0.166129 0.141785 0.140273
qa: -0.1058 -0.3729 -0.4465 -0.0470 -0.0142 -0.3733 0.2442 0.1325 0.0721 -0.1942 -0.3232 -0.3233 -0.3590 -0.1037 0.3225 -0.0960 0.0467 -0.1505 0.0267 -0.2149 -0.1983 -0.1144 -0.1653 -0.1764 0.1096 0.0816 0.1108 0.1108 0.0964 0.1104 0.1187 0.1139 0.1080 0.0995 0.1150 0.1059 0.1125 0.1151 0.1033 0.0534 0.0956 0.0929 0.1765 0.1805 0.1377 0.1379 0.1661 0.1418 0.1403
va: 1.1996 1.9751 2.0603 3.1392 3.2437 3.1032 4.0806 3.9123 3.9044 3.7481 3.9539 3.9156 3.9240 3.8705 4.2739 3.8141 3.6212 3.9145 4.0397 4.0206 3.9394 4.0225 3.9899 4.0537 3.8052 1.0031 0.9936 1.0215 1.0048 1.0033 0.9965 1.0115 1.0152 1.0043 0.9988 0.9994 1.0039 1.0174 1.0183 1.0056 1.0041 1.0033 0.9923 0.9864 1.0041 1.0030 1.0007 1.0061 1.0081
dispcorr: -0.029516161 hartree
energy: -1513.550777197267
dipole: 33.26965 -31.54008 1.72958 -1.69120 3.35236 1.66116 9.03362 -8.36778 0.66585
magnitude: 2.48882 au
magnitude: 6.32609 debye
