program: Gaussian 09
title: 000034492
version: EM64L-G09RevD.01
frameworkgroup: C1[X(C13H21NO2)]
method: RPBEPBE
basis: SDD
operation: Freq
keyword: #p
keyword: freq=noraman
keyword: PBEPBE/SDD
title: #p freq=noraman PBEPBE/SDD
converged: YES YES NO NO
title: Mulliken charges:
elementType: O O N C C C C C C C C C C C C C H H H H H H H H H H H H H H H H H H H H H
charge: -0.301929 -0.280981 -0.129022 -0.469572 0.191862 -0.294305 -0.301429 0.194521 0.202834 -0.693589 -0.684695 -0.379576 -0.393967 -0.208051 -0.530166 -0.538174 0.227092 0.224145 0.177476 0.234589 0.178233 0.203606 0.221535 0.206657 0.208893 0.207241 0.220782 0.220940 0.246170 0.237939 0.223390 0.267680 0.205385 0.219524 0.218887 0.223201 0.242876
chargesum: 0.00000
title: Mulliken charges with hydrogens summed into heavy atoms:
elementType: O O N C C C C C C C C C C C C C
charge: -0.301929 -0.280981 -0.129022 -0.018335 0.191862 0.117760 0.080410 0.194521 0.202834 -0.056504 -0.035733 -0.133406 -0.156029 0.015339 0.162422 0.146789
polarizability: 1.84287134e+02 -5.80847875e+00 1.71486649e+02 1.01860529e+01 8.25698682e+00 1.14386528e+02
1716.lowfreq: -14.1758 -10.0974 -8.0389 -0.0007 -0.0003 0.0004 10.1617 32.9548 50.9723
frequency: 4.5856 32.5886 50.9464 59.5969 73.9735 84.9551 105.3246 139.3639 167.8916 179.1240 187.9565 200.9739 220.9495 235.5520 255.1794 277.2586 289.3512 306.9052 335.5175 352.8574 389.9989 436.6519 463.9804 479.5306 515.3652 528.2608 583.3992 629.5361 679.3529 710.6728 752.5968 787.4576 795.4347 800.0521 828.2527 837.2981 867.9215 908.1075 953.4843 959.0831 970.6349 979.7440 1052.2748 1056.0941 1071.0169 1074.6706 1084.6377 1112.0615 1113.4155 1121.3215 1148.9102 1155.0065 1160.3600 1178.5235 1185.7129 1196.4155 1217.2628 1238.0497 1264.5543 1279.7324 1282.8690 1361.4353 1363.2803 1371.3011 1383.6853 1387.6058 1389.9675 1418.3855 1433.9717 1451.1053 1454.2482 1455.3904 1459.8685 1464.5142 1466.1134 1467.9528 1469.8555 1476.0389 1478.2282 1485.2946 1486.8989 1491.3587 1589.5490 1596.3999 2844.3630 2863.1352 2922.0277 2941.5969 2958.8662 2981.2456 2987.0357 3036.4700 3040.5281 3046.6782 3049.7238 3060.9614 3076.0358 3079.1316 3085.5192 3092.3965 3105.2195 3121.0743 3134.3942 3160.7270 3172.3656
redmass: 2.9140 2.9826 2.5825 3.3334 2.8276 2.0377 2.6253 3.0862 2.7648 3.0682 1.5203 1.1237 1.4386 1.5095 2.7458 1.8455 2.3154 2.3416 2.6608 3.4256 4.1679 3.0492 3.3466 3.8453 5.9813 3.4992 4.2617 4.6127 4.4295 2.7125 1.7753 1.5904 1.1999 1.7186 3.9727 4.1183 1.4879 2.1136 2.1267 1.8357 2.8972 2.5895 2.6450 3.6333 1.9691 2.0511 2.0712 1.3938 1.7408 1.2460 1.3867 1.3519 1.9678 1.3646 2.2039 2.4675 2.0816 3.8966 1.3175 1.1365 1.1711 1.2920 1.3363 1.5820 3.0384 1.3496 1.2389 1.3226 1.2491 1.3005 1.3096 1.4731 1.4864 1.0568 1.0804 1.0508 1.0570 1.0680 1.1764 1.0537 1.0620 1.0663 6.8287 7.3629 1.0722 1.0719 1.0690 1.0316 1.0328 1.0356 1.0359 1.0868 1.1055 1.1038 1.0885 1.0893 1.0969 1.0980 1.0997 1.1000 1.1007 1.0994 1.0867 1.0917 1.0980
irintensity: 1.9022 1.9185 0.6510 1.2536 2.6515 3.7747 7.8757 1.1622 3.1565 1.5608 0.7359 0.1204 1.5494 1.3366 1.4832 0.9720 1.5491 7.7698 1.6367 0.6809 7.9840 1.4026 0.4890 15.4970 5.5557 1.2549 4.4619 1.9528 1.1071 29.2146 32.3737 14.0453 10.2183 11.5659 7.3559 6.7424 0.9664 1.5591 11.3168 16.7588 5.3677 3.0818 41.1694 198.1070 10.5959 43.0309 4.5249 1.2667 4.7573 6.1031 3.7108 1.7589 23.5596 15.1184 16.7500 15.2988 77.4235 56.1080 11.5645 6.4117 13.4704 4.6318 8.4874 1.5192 4.1048 24.1408 30.5330 19.3982 14.1388 20.1929 33.3455 37.4480 3.4507 6.4323 15.8704 6.6059 8.3437 7.1449 13.7631 15.0883 10.3162 7.9506 91.5593 33.2493 73.4676 130.9129 74.4427 73.6398 70.5297 33.6345 29.6681 16.9014 16.9883 45.9016 0.9207 8.2276 41.2519 55.8795 62.3389 42.6522 30.5644 22.9341 7.7030 13.0503 16.0040
temp: 298.150 k
press: 1.00000 atm
elementType: 8 8 7 6 6 6 6 6 6 6 6 6 6 6 6 6 1 1 1 1 1 1 1 1 1 1 1 1 1 1 1 1 1 1 1 1 1
symmnumber: 1
zpe: 828847.6 jmol-1
zpe.correction: 0.315691 hartree
zpe.thermalcorrener: 0.334140 hartree
zpe.thermalcorrenthalpy: 0.335084 hartree
zpe.thermalcorrgfe: 0.266657 hartree
zpe.sumelectzpe: -711.870346 hartree
zpe.sumelectthermal: -711.851898 hartree
zpe.sumelectthermalent: -711.850954 hartree
zpe.sumelectthermalfe: -711.919381 hartree
dipole: 1.2272 -2.1914 1.1848
dipole: 2.7771
quadrupole: -84.0532 -93.1073 -99.8538
quadrupole: -5.3613 1.3844 4.9425
quadrupole: 8.2849 -0.7692 -7.5157 -5.3613 1.3844 4.9425
hfenergy: -712.1860377 hartree
pointgroup: C01 [X(C13H21N1O2)]
dipole: -0.3422328 -0.9509023 -0.4152244 debye
polarizability: 182.4253064|7.9422731|172.9519094|9.8677641|-9.4239333|114.7830961 unknown
InChI: InChI=1S/C13H21NO2/c1-5-14(6-2)10-11-12(15-3)8-7-9-13(11)16-4/h7-9H,5-6,10H2,1-4H3
charge 0 multiplicity 1
37 atoms
O  0.066569 2.491107 0.2552
O  -1.261514 -2.149467 0.702398
N  1.869687 -0.373481 -0.049997
C  0.792662 -0.223171 0.988721
C  -0.572418 0.128898 0.421735
C  1.614739 -1.537333 -0.94931
C  3.209916 -0.458017 0.600963
C  -0.891427 1.465365 0.063084
C  -1.613505 -0.840677 0.311903
C  2.416177 -1.471791 -2.262988
C  3.711233 0.886077 1.164151
C  -2.17533 1.829739 -0.407684
C  -2.904788 -0.495436 -0.156936
C  -3.175303 0.84402 -0.516003
C  0.949838 2.729321 -0.909785
C  -2.303638 -3.176436 0.664567
H  1.098846 0.604221 1.650714
H  0.706502 -1.150543 1.599725
H  1.816706 -2.505735 -0.424659
H  0.538235 -1.536217 -1.191104
H  3.210629 -1.230466 1.41359
H  3.930097 -0.803909 -0.1621
H  2.197541 -0.529754 -2.796809
H  3.507619 -1.525399 -2.097863
H  2.139357 -2.318377 -2.918924
H  4.732665 0.769048 1.571973
H  3.069829 1.268413 1.977393
H  3.738214 1.649285 0.366786
H  -2.371865 2.877923 -0.652872
H  -3.694666 -1.247001 -0.239665
H  -4.175399 1.114904 -0.872124
H  1.530962 1.812362 -1.12443
H  0.351342 3.033638 -1.791943
H  1.616087 3.553855 -0.610075
H  -2.677666 -3.336907 -0.365495
H  -3.150324 -2.917009 1.329535
H  -1.814909 -4.093149 1.026827
