program: Orca
programVersion: 4.2.1
elementType: Cl O O N N N C C C C C C C C C C C C C C C C C C C H H H H H H H H H H H H H H H H H H H H H H H H
charge: 0
multiplicity: 1
keywords: wb97x-d3
keywords: def2-TZVPP
keywords: def2/J RIJCOSX GRIDX6 NOFINALGRIDX
keywords: grid4 nofinalgrid
keywords: scfconv7
keywords: smallprint printgap noloewdin
keywords: NOSOSCF
formula: C19H24ClN3O2
InChI: InChI=1S/C19H24ClN3O2/c1-18(2)13-25-19(3,23(18)17(24)22-12-11-21-14-22)10-4-5-15-6-8-16(20)9-7-15/h6-9,11-12,14H,4-5,10,13H2,1-3H3
49 atoms
Cl -6.173875 0.85273 0.612865
O  2.771525 1.373988 0.867154
O  0.013094 -1.645308 0.278998
N  2.04825 -0.648557 0.178881
N  1.755776 -2.878626 -0.496378
N  1.979578 -4.606057 -1.839174
C  1.58464 0.622728 0.811563
C  3.440879 -0.503086 -0.318672
C  3.547406 1.021785 -0.24873
C  0.533843 1.319015 -0.066878
C  1.115441 0.414079 2.241011
C  4.457285 -1.135325 0.626815
C  3.663834 -0.963826 -1.751837
C  0.2767 2.772231 0.313767
C  1.197831 -1.664928 0.019754
C  -0.836801 3.40493 -0.529235
C  -2.18442 2.789632 -0.275627
C  2.471261 -3.820222 0.201489
C  1.466199 -3.416967 -1.709168
C  -2.716841 1.823193 -1.124395
C  -2.920259 3.145336 0.853277
C  2.600805 -4.873949 -0.650817
C  -3.939517 1.221717 -0.860668
C  -4.144425 2.558953 1.133995
C  -4.644054 1.595807 0.27112
H  4.571997 1.35842 -0.091065
H  3.17496 1.487865 -1.17033
H  -0.394243 0.751954 -0.005471
H  0.846475 1.277676 -1.115399
H  1.016371 1.375377 2.745186
H  1.835458 -0.182204 2.80228
H  0.148269 -0.0804 2.2817
H  5.466717 -0.877557 0.302531
H  4.393776 -2.221439 0.630124
H  4.334702 -0.78126 1.65083
H  3.8041 -2.039371 -1.841003
H  2.850884 -0.656731 -2.410818
H  4.578116 -0.498357 -2.12542
H  0.0062 2.855214 1.370168
H  1.1850 3.362969 0.179715
H  -0.582938 3.321823 -1.589303
H  -0.877664 4.47324 -0.304054
H  2.780451 -3.676649 1.222723
H  0.900268 -2.878596 -2.453761
H  -2.172601 1.526905 -2.013116
H  -2.536503 3.899102 1.530961
H  3.102749 -5.810752 -0.465889
H  -4.332713 0.471308 -1.533251
H  -4.700197 2.853248 2.014195
elementType: Cl O N C H
totalener: -1513.52226540 hartree
nucrepener: 2390.57301166 hartree
electener: -3904.09527706 hartree
oneelecener: -6818.34147135 hartree
twoeener: 2914.24619429 hartree
cpcmener: -0.03340659 hartree
kineticenergy: 1508.15595328 hartree
xcener: -124.304725281122 hartree
chargesum: -0.0000000
charge: -0.105855 -0.386966 -0.456266 -0.062237 -0.034042 -0.371799 0.349978 0.112722 0.054645 -0.255327 -0.314699 -0.346387 -0.341603 -0.137394 0.369183 -0.096337 0.046798 -0.151864 0.030558 -0.216612 -0.221632 -0.127754 -0.128753 -0.145871 0.081490 0.115134 0.085522 0.104629 0.093414 0.110260 0.106838 0.106613 0.107192 0.113928 0.112981 0.104061 0.111600 0.121555 0.084573 0.083798 0.090933 0.100541 0.191176 0.175344 0.143097 0.141093 0.165504 0.143258 0.142981
qa: -0.1059 -0.3870 -0.4563 -0.0622 -0.0340 -0.3718 0.3500 0.1127 0.0546 -0.2553 -0.3147 -0.3464 -0.3416 -0.1374 0.3692 -0.0963 0.0468 -0.1519 0.0306 -0.2166 -0.2216 -0.1278 -0.1288 -0.1459 0.0815 0.1151 0.0855 0.1046 0.0934 0.1103 0.1068 0.1066 0.1072 0.1139 0.1130 0.1041 0.1116 0.1216 0.0846 0.0838 0.0909 0.1005 0.1912 0.1753 0.1431 0.1411 0.1655 0.1433 0.1430
va: 1.1991 1.9670 2.0575 3.1646 3.2554 3.1134 4.0498 3.9236 3.9308 3.8732 3.9305 3.9517 3.9529 3.8732 4.2572 3.8292 3.5587 3.9105 4.0436 3.9389 3.9890 4.0413 3.9719 3.9735 3.8351 0.9910 0.9995 1.0340 1.0078 1.0035 1.0071 1.0162 1.0032 1.0019 1.0061 0.9959 1.0006 1.0036 1.0077 1.0274 1.0104 1.0059 0.9795 0.9972 1.0010 1.0026 1.0021 1.0039 1.0045
dispcorr: -0.028501541 hartree
energy: -1513.550766945412
dipole: 36.17585 -33.48768 2.68817 7.70943 -5.47741 2.23203 -0.98814 1.12690 0.13876
magnitude: 3.49678 au
magnitude: 8.88811 debye
