program: Orca
programVersion: 4.2.1
elementType: Cl O O N N N C C C C C C C C C C C C C C C C C C C H H H H H H H H H H H H H H H H H H H H H H H H
charge: 0
multiplicity: 1
keywords: wb97x-d3
keywords: def2-TZVPP
keywords: def2/J RIJCOSX GRIDX6 NOFINALGRIDX
keywords: grid4 nofinalgrid
keywords: scfconv7
keywords: smallprint printgap noloewdin
keywords: NOSOSCF
formula: C19H24ClN3O2
InChI: InChI=1S/C19H24ClN3O2/c1-18(2)13-25-19(3,23(18)17(24)22-12-11-21-14-22)10-4-5-15-6-8-16(20)9-7-15/h6-9,11-12,14H,4-5,10,13H2,1-3H3
49 atoms
Cl -5.986129 1.600004 -1.701561
O  2.363953 1.684013 0.037046
O  2.392695 -1.700221 2.399335
N  2.163919 -0.514222 0.47647
N  1.728161 -2.821303 0.545193
N  1.794314 -4.939205 -0.046653
C  2.402058 0.805263 1.132931
C  2.270487 -0.390393 -1.004121
C  2.900613 1.003906 -1.068162
C  1.29401 1.184395 2.115408
C  3.771827 0.882958 1.805984
C  3.199671 -1.406889 -1.652313
C  0.918436 -0.36783 -1.708859
C  -0.138368 1.136048 1.58498
C  2.129891 -1.627486 1.217259
C  -0.606117 2.41811 0.888066
C  -1.95532 2.253851 0.246523
C  0.483117 -3.123252 0.047822
C  2.466532 -3.961441 0.487161
C  -3.101471 2.056249 1.015595
C  -2.092359 2.253699 -1.13866
C  0.55101 -4.433142 -0.313657
C  -4.340832 1.855848 0.427987
C  -3.323964 2.05623 -1.747771
C  -4.440795 1.854305 -0.955257
H  3.995806 0.946293 -1.020504
H  2.631703 1.538197 -1.979443
H  1.522789 2.188566 2.486317
H  1.381908 0.529843 2.982467
H  3.822947 0.280441 2.70842
H  3.967866 1.919131 2.085451
H  4.574178 0.557303 1.142559
H  4.120054 -1.540899 -1.082719
H  3.479894 -1.038667 -2.641229
H  2.733346 -2.378827 -1.803674
H  0.251976 0.387662 -1.292742
H  1.067827 -0.130362 -2.763509
H  0.41149 -1.328808 -1.671081
H  -0.26732 0.281839 0.915119
H  -0.80504 0.940243 2.428177
H  0.116999 2.723139 0.132009
H  -0.640076 3.225482 1.626103
H  -0.330302 -2.418308 0.042881
H  3.490114 -3.997938 0.827162
H  -3.034712 2.059932 2.097268
H  -1.223477 2.417302 -1.765097
H  -0.233547 -5.037771 -0.741405
H  -5.217176 1.70462 1.044086
H  -3.40403 2.060903 -2.826621
elementType: Cl O N C H
totalener: -1513.51918978 hartree
nucrepener: 2422.48332060 hartree
electener: -3936.00251037 hartree
oneelecener: -6881.50920738 hartree
twoeener: 2945.50669701 hartree
cpcmener: -0.03050346 hartree
kineticenergy: 1508.14846450 hartree
xcener: -124.304829314753 hartree
chargesum: -0.0000000
charge: -0.105662 -0.378849 -0.452678 -0.066133 -0.024427 -0.371803 0.256838 0.133241 0.073408 -0.164109 -0.316553 -0.343576 -0.336783 -0.156578 0.352271 -0.088524 0.016173 -0.155277 0.036925 -0.215162 -0.190066 -0.123521 -0.149666 -0.152594 0.087412 0.085281 0.108472 0.095632 0.116193 0.109502 0.108258 0.100060 0.113105 0.120999 0.103603 0.065975 0.114389 0.123711 0.070468 0.102411 0.099364 0.097922 0.191564 0.172401 0.140730 0.143527 0.167384 0.142587 0.142157
qa: -0.1057 -0.3788 -0.4527 -0.0661 -0.0244 -0.3718 0.2568 0.1332 0.0734 -0.1641 -0.3166 -0.3436 -0.3368 -0.1566 0.3523 -0.0885 0.0162 -0.1553 0.0369 -0.2152 -0.1901 -0.1235 -0.1497 -0.1526 0.0874 0.0853 0.1085 0.0956 0.1162 0.1095 0.1083 0.1001 0.1131 0.1210 0.1036 0.0660 0.1144 0.1237 0.0705 0.1024 0.0994 0.0979 0.1916 0.1724 0.1407 0.1435 0.1674 0.1426 0.1422
va: 1.1996 1.9688 2.0614 3.1319 3.2505 3.1153 4.1015 3.8945 3.8788 3.7662 3.9316 3.9604 3.9447 3.9012 4.2658 3.7526 3.5771 3.9159 4.0413 4.0031 3.9445 4.0513 3.9846 4.0053 3.8301 1.0031 0.9944 1.0144 1.0229 1.0210 1.0094 1.0042 1.0005 1.0029 0.9960 1.0111 1.0066 1.0037 1.0157 1.0116 1.0280 1.0098 0.9776 0.9997 1.0032 0.9991 1.0025 1.0053 1.0063
dispcorr: -0.030111829 hartree
energy: -1513.549301603851
dipole: 29.46850 -28.36994 1.09855 3.33468 -1.29343 2.04126 2.62104 -3.55645 -0.93541
magnitude: 2.49971 au
magnitude: 6.35375 debye
