program: Orca
programVersion: 4.2.1
elementType: Cl O O N N N C C C C C C C C C C C C C C C C C C C H H H H H H H H H H H H H H H H H H H H H H H H
charge: 0
multiplicity: 1
keywords: wb97x-d3
keywords: def2-TZVPP
keywords: def2/J RIJCOSX GRIDX6 NOFINALGRIDX
keywords: grid4 nofinalgrid
keywords: scfconv7
keywords: smallprint printgap noloewdin
keywords: NOSOSCF
formula: C19H24ClN3O2
InChI: InChI=1S/C19H24ClN3O2/c1-18(2)13-25-19(3,23(18)17(24)22-12-11-21-14-22)10-4-5-15-6-8-16(20)9-7-15/h6-9,11-12,14H,4-5,10,13H2,1-3H3
49 atoms
Cl -6.137141 0.813118 0.429836
O  2.861353 1.457077 0.635439
O  0.00706 -1.532985 0.575907
N  2.050608 -0.610545 0.225947
N  1.650807 -2.881795 -0.219829
N  1.727328 -4.718693 -1.427284
C  1.663488 0.73017 0.762458
C  3.410399 -0.556347 -0.372993
C  3.542584 0.963055 -0.48832
C  0.552113 1.359593 -0.090228
C  1.32238 0.677907 2.241287
C  4.478328 -1.0935 0.57564
C  3.537821 -1.187338 -1.752132
C  0.28995 2.828904 0.218052
C  1.167332 -1.611733 0.230626
C  -0.814066 3.415653 -0.669831
C  -2.157948 2.787496 -0.427127
C  2.455522 -3.760627 0.463996
C  1.222698 -3.522063 -1.33887
C  -2.910739 3.143067 0.690701
C  -2.67142 1.811273 -1.276045
C  2.492928 -4.882854 -0.305305
C  -4.131838 2.545664 0.961551
C  -3.89148 1.199401 -1.022864
C  -4.611767 1.572038 0.099174
H  4.580521 1.292827 -0.449043
H  3.105286 1.328222 -1.426707
H  -0.362853 0.786781 0.054942
H  0.808969 1.259454 -1.149942
H  1.316167 1.685304 2.657879
H  2.065221 0.097758 2.789786
H  0.341795 0.242329 2.418368
H  4.408314 -2.171265 0.704491
H  4.422551 -0.626862 1.559542
H  5.467596 -0.889138 0.16352
H  3.662472 -2.268345 -1.719611
H  2.690513 -0.946116 -2.394439
H  4.433032 -0.785204 -2.230823
H  0.004976 2.959987 1.265752
H  1.198322 3.415713 0.067013
H  -0.534244 3.299859 -1.720115
H  -0.876227 4.490387 -0.483162
H  2.876624 -3.533963 1.428121
H  0.564239 -3.050289 -2.052198
H  -2.543427 3.905637 1.367747
H  -2.114161 1.513495 -2.156162
H  3.022142 -5.800452 -0.099987
H  -4.699884 2.84029 1.833761
H  -4.269097 0.441486 -1.695998
elementType: Cl O N C H
totalener: -1513.52248581 hartree
nucrepener: 2393.23483819 hartree
electener: -3906.75732400 hartree
oneelecener: -6823.70024836 hartree
twoeener: 2916.94292436 hartree
cpcmener: -0.03323829 hartree
kineticenergy: 1508.14281759 hartree
xcener: -124.302905781643 hartree
chargesum: 0.0000000
charge: -0.106240 -0.386826 -0.456368 -0.065758 -0.033294 -0.371790 0.350352 0.113370 0.055182 -0.252451 -0.317456 -0.343575 -0.336556 -0.135860 0.366192 -0.100773 0.038956 -0.151687 0.034812 -0.215951 -0.204963 -0.127353 -0.148126 -0.132706 0.084300 0.113838 0.085303 0.105972 0.089921 0.110151 0.106959 0.107966 0.112489 0.112955 0.107162 0.102855 0.110952 0.121100 0.083278 0.084323 0.090909 0.101633 0.190877 0.174283 0.140869 0.139903 0.164993 0.142778 0.143097
qa: -0.1062 -0.3868 -0.4564 -0.0658 -0.0333 -0.3718 0.3504 0.1134 0.0552 -0.2525 -0.3175 -0.3436 -0.3366 -0.1359 0.3662 -0.1008 0.0390 -0.1517 0.0348 -0.2160 -0.2050 -0.1274 -0.1481 -0.1327 0.0843 0.1138 0.0853 0.1060 0.0899 0.1102 0.1070 0.1080 0.1125 0.1130 0.1072 0.1029 0.1110 0.1211 0.0833 0.0843 0.0909 0.1016 0.1909 0.1743 0.1409 0.1399 0.1650 0.1428 0.1431
va: 1.1984 1.9677 2.0569 3.1595 3.2566 3.1141 4.0516 3.9211 3.9337 3.8646 3.9316 3.9530 3.9487 3.8645 4.2620 3.8312 3.5657 3.9136 4.0422 3.9845 3.9380 4.0423 3.9759 3.9756 3.8318 0.9909 1.0002 1.0348 1.0088 1.0029 1.0067 1.0149 1.0026 1.0063 1.0032 0.9959 1.0012 1.0040 1.0064 1.0302 1.0106 1.0055 0.9796 0.9977 1.0025 1.0024 1.0027 1.0046 1.0040
dispcorr: -0.028481394 hartree
energy: -1513.550967204918
dipole: 36.42764 -33.66076 2.76688 7.80626 -5.62574 2.18052 -1.48697 1.37962 -0.10736
magnitude: 3.52446 au
magnitude: 8.95847 debye
