program: Orca
programVersion: 4.2.1
elementType: Cl O O N N N C C C C C C C C C C C C C C C C C C C H H H H H H H H H H H H H H H H H H H H H H H H
charge: 0
multiplicity: 1
keywords: wb97x-d3
keywords: def2-TZVPP
keywords: def2/J RIJCOSX GRIDX6 NOFINALGRIDX
keywords: grid4 nofinalgrid
keywords: scfconv7
keywords: smallprint printgap noloewdin
keywords: NOSOSCF
formula: C19H24ClN3O2
InChI: InChI=1S/C19H24ClN3O2/c1-18(2)13-25-19(3,23(18)17(24)22-12-11-21-14-22)10-4-5-15-6-8-16(20)9-7-15/h6-9,11-12,14H,4-5,10,13H2,1-3H3
49 atoms
Cl -6.182242 1.668475 -1.504076
O  2.425054 1.677575 0.06716
O  2.328451 -1.720482 2.406746
N  2.219492 -0.526101 0.478514
N  1.810511 -2.839055 0.504939
N  1.946969 -4.951961 -0.092571
C  2.396902 0.791328 1.156923
C  2.42911 -0.392378 -0.988812
C  3.043637 1.010809 -1.00293
C  1.22144 1.153834 2.06293
C  3.716111 0.878708 1.924071
C  3.415518 -1.392389 -1.575049
C  1.128874 -0.383876 -1.785772
C  -0.177109 1.09069 1.451747
C  2.148693 -1.644602 1.209557
C  -0.596131 2.330969 0.655926
C  -1.990349 2.200355 0.110415
C  0.609356 -3.153303 -0.084348
C  2.566141 -3.9696 0.493301
C  -3.09904 2.270437 0.952588
C  -2.214166 1.968563 -1.243473
C  0.720503 -4.459511 -0.447947
C  -4.387412 2.109581 0.467621
C  -3.495731 1.804562 -1.750489
C  -4.574748 1.873882 -0.885992
H  4.133686 0.967287 -0.882649
H  2.82959 1.546738 -1.927543
H  1.412833 2.159914 2.449375
H  1.259169 0.498404 2.933139
H  4.56489 0.555903 1.319804
H  3.707142 0.278658 2.829746
H  3.886011 1.916633 2.213819
H  4.296298 -1.514103 -0.943445
H  3.757367 -1.016948 -2.541558
H  2.975355 -2.370639 -1.759634
H  1.344281 -0.120645 -2.822454
H  0.641939 -1.35575 -1.801887
H  0.419856 0.348338 -1.39948
H  -0.285479 0.196627 0.831049
H  -0.887807 0.955997 2.271127
H  0.099172 2.511419 -0.163297
H  -0.53669 3.204734 1.311833
H  -0.211639 -2.459519 -0.14332
H  3.5634 -3.996214 0.904673
H  -2.962004 2.459397 2.010986
H  -1.3758 1.922119 -1.928371
H  -0.022477 -5.071319 -0.935249
H  -5.2335 2.169934 1.13904
H  -3.644084 1.627846 -2.807388
elementType: Cl O N C H
totalener: -1513.51957271 hartree
nucrepener: 2413.31743824 hartree
electener: -3926.83701095 hartree
oneelecener: -6863.15152151 hartree
twoeener: 2936.31451056 hartree
cpcmener: -0.03071786 hartree
kineticenergy: 1508.15621208 hartree
xcener: -124.306069357888 hartree
chargesum: 0.0000000
charge: -0.105699 -0.380254 -0.451969 -0.062269 -0.023168 -0.370938 0.254198 0.123913 0.076508 -0.162654 -0.318452 -0.343405 -0.334223 -0.166127 0.351718 -0.076407 0.015098 -0.154626 0.035674 -0.220102 -0.183004 -0.123613 -0.149371 -0.156433 0.089939 0.086518 0.110036 0.095695 0.115180 0.100494 0.109172 0.108921 0.113712 0.120288 0.103998 0.114321 0.123698 0.064747 0.074880 0.103824 0.092676 0.096823 0.190608 0.172654 0.141314 0.145223 0.167439 0.142181 0.141261
qa: -0.1057 -0.3803 -0.4520 -0.0623 -0.0232 -0.3709 0.2542 0.1239 0.0765 -0.1627 -0.3185 -0.3434 -0.3342 -0.1661 0.3517 -0.0764 0.0151 -0.1546 0.0357 -0.2201 -0.1830 -0.1236 -0.1494 -0.1564 0.0899 0.0865 0.1100 0.0957 0.1152 0.1005 0.1092 0.1089 0.1137 0.1203 0.1040 0.1143 0.1237 0.0647 0.0749 0.1038 0.0927 0.0968 0.1906 0.1727 0.1413 0.1452 0.1674 0.1422 0.1413
va: 1.1995 1.9650 2.0623 3.1236 3.2497 3.1159 4.1015 3.9038 3.8713 3.7605 3.9310 3.9592 3.9468 3.8991 4.2660 3.7430 3.5794 3.9166 4.0423 4.0090 3.9537 4.0516 3.9848 4.0112 3.8272 1.0035 0.9946 1.0153 1.0229 1.0041 1.0209 1.0093 1.0001 1.0031 0.9959 1.0073 1.0030 1.0119 1.0164 1.0137 1.0279 1.0111 0.9782 0.9996 1.0026 0.9966 1.0025 1.0055 1.0071
dispcorr: -0.029956116 hartree
energy: -1513.549528828705
dipole: 30.73086 -29.51257 1.21829 2.99778 -0.97729 2.02048 1.76635 -2.75584 -0.98949
magnitude: 2.55845 au
magnitude: 6.50307 debye
