program: Orca
programVersion: 4.2.1
elementType: Cl O O N N N C C C C C C C C C C C C C C C C C C C H H H H H H H H H H H H H H H H H H H H H H H H
charge: 0
multiplicity: 1
keywords: wb97x-d3
keywords: def2-TZVPP
keywords: def2/J RIJCOSX GRIDX6 NOFINALGRIDX
keywords: grid4 nofinalgrid
keywords: scfconv7
keywords: smallprint printgap noloewdin
keywords: NOSOSCF
formula: C19H24ClN3O2
InChI: InChI=1S/C19H24ClN3O2/c1-18(2)13-25-19(3,23(18)17(24)22-12-11-21-14-22)10-4-5-15-6-8-16(20)9-7-15/h6-9,11-12,14H,4-5,10,13H2,1-3H3
49 atoms
Cl -5.722629 2.69643 -2.318039
O  2.896621 1.418484 0.655608
O  2.74447 -2.65915 -1.125063
N  2.396444 -0.646166 -0.133631
N  1.641278 -2.645487 0.855347
N  -0.028075 -3.531205 1.985698
C  2.391719 0.182641 1.1124
C  2.968858 0.120755 -1.265112
C  2.732928 1.528487 -0.73735
C  1.01203 0.396295 1.741815
C  3.370464 -0.344905 2.152317
C  4.465619 -0.135228 -1.436402
C  2.21538 -0.088284 -2.569579
C  -0.097432 0.870739 0.814104
C  2.318072 -1.982244 -0.215745
C  -1.449082 0.915891 1.531648
C  -2.548347 1.358055 0.609053
C  2.175839 -3.669181 1.601279
C  0.304115 -2.63033 1.10987
C  -2.840275 2.708757 0.437975
C  -3.264148 0.431417 -0.144281
C  1.133396 -4.182032 2.306891
C  -3.812972 3.129586 -0.456722
C  -4.240594 0.830992 -1.044491
C  -4.505601 2.182675 -1.194134
H  3.464078 2.24102 -1.121318
H  1.734527 1.891526 -1.007214
H  1.155557 1.137305 2.533853
H  0.70197 -0.511484 2.260999
H  3.013015 -1.255218 2.629596
H  3.500605 0.398872 2.939231
H  4.347328 -0.544783 1.711522
H  5.026568 0.118617 -0.535937
H  4.848945 0.486625 -2.246857
H  4.676635 -1.171408 -1.690658
H  2.451882 -1.037761 -3.043808
H  1.135999 -0.033263 -2.421341
H  2.491841 0.703401 -3.268424
H  0.126011 1.870406 0.435145
H  -0.17841 0.221655 -0.06334
H  -1.381294 1.594799 2.385531
H  -1.682843 -0.07142 1.94045
H  3.224488 -3.913865 1.577719
H  -0.369108 -1.958503 0.601052
H  -2.303248 3.453377 1.013736
H  -3.065011 -0.627604 -0.029204
H  1.157514 -4.981376 3.03069
H  -4.026413 4.183678 -0.572912
H  -4.786111 0.09391 -1.618427
elementType: Cl O N C H
totalener: -1513.52017801 hartree
nucrepener: 2401.17402243 hartree
electener: -3914.69420044 hartree
oneelecener: -6838.87235102 hartree
twoeener: 2924.17815058 hartree
cpcmener: -0.02980364 hartree
kineticenergy: 1508.15693012 hartree
xcener: -124.304551863573 hartree
chargesum: 0.0000000
charge: -0.104751 -0.377432 -0.445054 -0.108187 -0.031947 -0.374691 0.359046 0.185887 0.015148 -0.293447 -0.327315 -0.354274 -0.320342 -0.167780 0.365092 -0.075683 0.050010 -0.164446 0.029239 -0.217701 -0.218133 -0.100281 -0.145871 -0.148149 0.085578 0.113686 0.084244 0.112312 0.103264 0.107842 0.115119 0.116774 0.107954 0.108772 0.109787 0.109667 0.101588 0.112690 0.104249 0.083767 0.101179 0.096013 0.189092 0.173267 0.141334 0.142577 0.165144 0.142229 0.142932
qa: -0.1048 -0.3774 -0.4451 -0.1082 -0.0319 -0.3747 0.3590 0.1859 0.0151 -0.2934 -0.3273 -0.3543 -0.3203 -0.1678 0.3651 -0.0757 0.0500 -0.1644 0.0292 -0.2177 -0.2181 -0.1003 -0.1459 -0.1481 0.0856 0.1137 0.0842 0.1123 0.1033 0.1078 0.1151 0.1168 0.1080 0.1088 0.1098 0.1097 0.1016 0.1127 0.1042 0.0838 0.1012 0.0960 0.1891 0.1733 0.1413 0.1426 0.1651 0.1422 0.1429
va: 1.2007 1.9722 2.0631 3.1226 3.2734 3.0932 3.9555 3.8701 3.9805 3.8649 3.9754 3.9355 3.9125 3.8666 4.2562 3.7738 3.5446 3.9161 4.0262 3.9945 3.9834 4.0107 3.9760 3.9922 3.8278 0.9966 0.9866 1.0215 1.0012 0.9967 1.0092 0.9991 1.0041 1.0012 1.0175 1.0153 1.0018 0.9999 1.0140 1.0170 1.0132 1.0110 0.9918 0.9926 1.0037 1.0016 0.9992 1.0052 1.0057
dispcorr: -0.029247202 hartree
energy: -1513.549425211260
dipole: 31.66599 -30.00026 1.66573 -1.64494 3.25374 1.60880 7.87092 -7.43552 0.43539
magnitude: 2.35637 au
magnitude: 5.98941 debye
