program: Orca
programVersion: 4.2.1
elementType: Cl O O N N N C C C C C C C C C C C C C C C C C C C H H H H H H H H H H H H H H H H H H H H H H H H
charge: 0
multiplicity: 1
keywords: wb97x-d3
keywords: def2-TZVPP
keywords: def2/J RIJCOSX GRIDX6 NOFINALGRIDX
keywords: grid4 nofinalgrid
keywords: scfconv7
keywords: smallprint printgap noloewdin
keywords: NOSOSCF
formula: C19H24ClN3O2
InChI: InChI=1S/C19H24ClN3O2/c1-18(2)13-25-19(3,23(18)17(24)22-12-11-21-14-22)10-4-5-15-6-8-16(20)9-7-15/h6-9,11-12,14H,4-5,10,13H2,1-3H3
49 atoms
Cl -5.705947 2.700415 -2.330665
O  2.897513 1.405785 0.676023
O  2.717376 -2.649275 -1.154068
N  2.388475 -0.64748 -0.134218
N  1.646847 -2.656173 0.84454
N  -0.004922 -3.565044 1.981989
C  2.387145 0.167639 1.119807
C  2.946536 0.133104 -1.263448
C  2.725382 1.535691 -0.714314
C  1.00621 0.3773 1.748773
C  3.364175 -0.371425 2.155611
C  4.43915 -0.128351 -1.460849
C  2.17241 -0.055246 -2.559085
C  -0.102729 0.850625 0.819861
C  2.306475 -1.982017 -0.23068
C  -1.458753 0.881409 1.529461
C  -2.552246 1.331671 0.603953
C  2.198455 -3.673836 1.585602
C  0.311375 -2.657189 1.107318
C  -2.835585 2.684828 0.43706
C  -3.269057 0.412141 -0.157054
C  1.166599 -4.200762 2.296671
C  -3.801612 3.114877 -0.460184
C  -4.23915 0.821092 -1.060031
C  -4.49601 2.174864 -1.204927
H  3.4598 2.247548 -1.093451
H  1.728507 1.910964 -0.972434
H  1.146229 1.116031 2.543533
H  0.697584 -0.533251 2.264054
H  3.002081 -1.280509 2.631353
H  3.501747 0.369303 2.944174
H  4.338435 -0.576887 1.711336
H  4.640223 -1.160945 -1.73696
H  5.013774 0.10517 -0.563339
H  4.815329 0.506134 -2.264819
H  1.095979 0.012684 -2.395114
H  2.44916 0.73818 -3.25578
H  2.388658 -1.004145 -3.044168
H  0.115321 1.854316 0.448506
H  -0.175431 0.206818 -0.062193
H  -1.399532 1.549835 2.392237
H  -1.6915 -0.11186 1.924242
H  3.24999 -3.905122 1.555107
H  -0.373178 -1.991287 0.60588
H  -2.296539 3.423476 1.01862
H  -3.07541 -0.648308 -0.045601
H  1.204215 -5.001119 3.018761
H  -4.0088 4.170565 -0.573281
H  -4.78633 0.089954 -1.64002
elementType: Cl O N C H
totalener: -1513.52016728 hartree
nucrepener: 2402.29550728 hartree
electener: -3915.81567456 hartree
oneelecener: -6841.10037382 hartree
twoeener: 2925.28469926 hartree
cpcmener: -0.02992839 hartree
kineticenergy: 1508.15831078 hartree
xcener: -124.304872671339 hartree
chargesum: -0.0000000
charge: -0.104659 -0.376589 -0.445455 -0.105614 -0.032829 -0.374846 0.359043 0.181695 0.018103 -0.294570 -0.328212 -0.352677 -0.320951 -0.169646 0.366407 -0.075971 0.050625 -0.164846 0.028413 -0.218924 -0.217950 -0.100634 -0.145724 -0.147181 0.084938 0.113569 0.083800 0.112782 0.103776 0.108384 0.115435 0.116135 0.109899 0.108106 0.108332 0.101725 0.112675 0.109736 0.105116 0.083869 0.101962 0.095213 0.189651 0.173576 0.141505 0.142426 0.165184 0.142163 0.143035
qa: -0.1047 -0.3766 -0.4455 -0.1056 -0.0328 -0.3748 0.3590 0.1817 0.0181 -0.2946 -0.3282 -0.3527 -0.3210 -0.1696 0.3664 -0.0760 0.0506 -0.1648 0.0284 -0.2189 -0.2179 -0.1006 -0.1457 -0.1472 0.0849 0.1136 0.0838 0.1128 0.1038 0.1084 0.1154 0.1161 0.1099 0.1081 0.1083 0.1017 0.1127 0.1097 0.1051 0.0839 0.1020 0.0952 0.1897 0.1736 0.1415 0.1424 0.1652 0.1422 0.1430
va: 1.2008 1.9730 2.0630 3.1215 3.2732 3.0936 3.9552 3.8743 3.9762 3.8642 3.9747 3.9345 3.9134 3.8670 4.2550 3.7752 3.5447 3.9156 4.0266 3.9946 3.9833 4.0099 3.9766 3.9909 3.8282 0.9964 0.9869 1.0215 1.0012 0.9962 1.0093 0.9994 1.0176 1.0041 1.0013 1.0013 1.0000 1.0155 1.0136 1.0173 1.0129 1.0113 0.9913 0.9926 1.0036 1.0018 0.9992 1.0052 1.0057
dispcorr: -0.029289216 hartree
energy: -1513.549456492136
dipole: 31.46219 -29.80530 1.65689 -1.64896 3.27209 1.62313 7.95074 -7.50293 0.44780
magnitude: 2.36228 au
magnitude: 6.00443 debye
