program: Orca
programVersion: 4.2.1
elementType: Cl O O N N N C C C C C C C C C C C C C C C C C C C H H H H H H H H H H H H H H H H H H H H H H H H
charge: 0
multiplicity: 1
keywords: wb97x-d3
keywords: def2-TZVPP
keywords: def2/J RIJCOSX GRIDX6 NOFINALGRIDX
keywords: grid4 nofinalgrid
keywords: scfconv7
keywords: smallprint printgap noloewdin
keywords: NOSOSCF
formula: C19H24ClN3O2
InChI: InChI=1S/C19H24ClN3O2/c1-18(2)13-25-19(3,23(18)17(24)22-12-11-21-14-22)10-4-5-15-6-8-16(20)9-7-15/h6-9,11-12,14H,4-5,10,13H2,1-3H3
49 atoms
Cl -6.409534 4.745259 0.505548
O  1.80485 1.047511 0.160189
O  1.322283 -2.927359 1.183572
N  2.310464 -1.152305 0.169365
N  3.131001 -3.329833 -0.126062
N  4.055557 -4.659202 -1.615885
C  1.276179 -0.172847 0.619358
C  3.499538 -0.439609 -0.371038
C  3.204423 0.946909 0.202061
C  -0.050544 -0.405663 -0.099302
C  1.136397 -0.136756 2.140386
C  4.83846 -0.935424 0.155194
C  3.493994 -0.377392 -1.895128
C  -1.099355 0.667072 0.17549
C  2.178296 -2.447634 0.47059
C  -2.36467 0.436583 -0.65356
C  -3.399601 1.492505 -0.390617
C  3.961987 -4.172426 0.569952
C  3.21266 -3.684181 -1.436478
C  -4.360517 1.324856 0.602932
C  -3.391007 2.691792 -1.098802
C  4.538204 -4.965941 -0.372572
C  -5.288618 2.31635 0.885863
C  -4.309391 3.695934 -0.831561
C  -5.253474 3.497907 0.163328
H  3.591295 1.043203 1.225126
H  3.637879 1.74656 -0.398541
H  -0.449828 -1.37843 0.192109
H  0.148946 -0.453099 -1.174343
H  0.565347 -0.978807 2.521624
H  0.62081 0.777946 2.433358
H  2.107966 -0.139063 2.636736
H  4.810118 -1.126191 1.228661
H  5.584866 -0.15738 -0.017103
H  5.197073 -1.829724 -0.3505
H  4.28065 0.297141 -2.236557
H  3.691822 -1.346417 -2.347828
H  2.544879 -0.00707 -2.283745
H  -1.370018 0.673751 1.234699
H  -0.700996 1.658939 -0.051916
H  -2.774194 -0.550914 -0.425374
H  -2.105112 0.429674 -1.715613
H  4.083727 -4.110618 1.638315
H  2.604504 -3.220459 -2.196864
H  -4.39304 0.402039 1.170034
H  -2.656824 2.850678 -1.87997
H  5.275752 -5.738544 -0.221445
H  -6.029196 2.163895 1.659573
H  -4.287283 4.618521 -1.39607
elementType: Cl O N C H
totalener: -1513.52365515 hartree
nucrepener: 2303.22476844 hartree
electener: -3816.74842359 hartree
oneelecener: -6643.28531632 hartree
twoeener: 2826.53689273 hartree
cpcmener: -0.03185782 hartree
kineticenergy: 1508.15379153 hartree
xcener: -124.302807907296 hartree
chargesum: -0.0000000
charge: -0.105974 -0.371783 -0.458035 -0.062196 -0.032506 -0.374437 0.307073 0.113489 0.069100 -0.226460 -0.344409 -0.329289 -0.346633 -0.124973 0.366679 -0.044655 0.026944 -0.145743 0.024338 -0.215777 -0.221682 -0.116034 -0.143381 -0.141694 0.080608 0.083048 0.109752 0.101107 0.085926 0.116862 0.108223 0.106128 0.111213 0.120127 0.101827 0.107627 0.112997 0.113104 0.082788 0.083837 0.090168 0.090508 0.182896 0.178637 0.140440 0.140675 0.164178 0.142565 0.142799
qa: -0.1060 -0.3718 -0.4580 -0.0622 -0.0325 -0.3744 0.3071 0.1135 0.0691 -0.2265 -0.3444 -0.3293 -0.3466 -0.1250 0.3667 -0.0447 0.0269 -0.1457 0.0243 -0.2158 -0.2217 -0.1160 -0.1434 -0.1417 0.0806 0.0830 0.1098 0.1011 0.0859 0.1169 0.1082 0.1061 0.1112 0.1201 0.1018 0.1076 0.1130 0.1131 0.0828 0.0838 0.0902 0.0905 0.1829 0.1786 0.1404 0.1407 0.1642 0.1426 0.1428
va: 1.1995 1.9733 2.0525 3.1466 3.2589 3.1067 4.0166 3.9253 3.9171 3.8632 3.9425 3.9400 3.9463 3.8065 4.2577 3.7561 3.5986 3.9146 4.0469 3.9807 3.9823 4.0167 3.9687 3.9709 3.8301 1.0024 0.9916 1.0277 1.0179 1.0177 1.0050 1.0045 1.0015 1.0041 0.9952 1.0033 1.0017 1.0063 1.0127 1.0357 1.0100 1.0102 0.9944 0.9878 1.0041 1.0037 1.0006 1.0048 1.0050
dispcorr: -0.027027233 hartree
energy: -1513.550682384106
dipole: 31.08759 -29.48605 1.60155 -10.41532 11.70071 1.28539 -1.53185 1.79173 0.25987
magnitude: 2.06995 au
magnitude: 5.26140 debye
