program: Orca
programVersion: 4.2.1
elementType: Cl O O N N N C C C C C C C C C C C C C C C C C C C H H H H H H H H H H H H H H H H H H H H H H H H
charge: 0
multiplicity: 1
keywords: wb97x-d3
keywords: def2-TZVPP
keywords: def2/J RIJCOSX GRIDX6 NOFINALGRIDX
keywords: grid4 nofinalgrid
keywords: scfconv7
keywords: smallprint printgap noloewdin
keywords: NOSOSCF
formula: C19H24ClN3O2
InChI: InChI=1S/C19H24ClN3O2/c1-18(2)13-25-19(3,23(18)17(24)22-12-11-21-14-22)10-4-5-15-6-8-16(20)9-7-15/h6-9,11-12,14H,4-5,10,13H2,1-3H3
49 atoms
Cl -6.124898 0.85239 0.933861
O  2.837501 1.567468 0.231971
O  0.22729 -1.548894 0.961361
N  2.110474 -0.568531 0.156865
N  1.686076 -2.849826 -0.18855
N  1.971623 -4.461196 -1.659473
C  1.695123 0.81122 0.550421
C  3.549759 -0.589606 -0.214484
C  3.958796 0.742131 0.416072
C  0.54135 1.298045 -0.32266
C  1.400366 0.92696 2.045665
C  4.352675 -1.721923 0.408364
C  3.764798 -0.524073 -1.723941
C  0.231855 2.783555 -0.179665
C  1.28169 -1.596986 0.363811
C  -0.951168 3.213726 -1.053556
C  -2.258238 2.634178 -0.590338
C  1.829349 -4.01016 0.531122
C  1.758827 -3.186933 -1.504005
C  -2.907658 3.170006 0.520539
C  -2.836487 1.535147 -1.218612
C  2.03046 -4.984759 -0.395969
C  -4.092974 2.632002 0.995362
C  -4.022963 0.979863 -0.75865
C  -4.641557 1.534853 0.348711
H  4.207167 0.617227 1.479151
H  4.818614 1.19248 -0.081481
H  -0.347123 0.712012 -0.081526
H  0.787007 1.083375 -1.367423
H  2.151319 0.413292 2.647202
H  0.427997 0.52046 2.306984
H  1.41072 1.978021 2.335023
H  4.247454 -2.667327 -0.119888
H  4.094667 -1.874561 1.456981
H  5.41141 -1.457317 0.367508
H  3.486869 -1.449089 -2.223141
H  3.202641 0.291466 -2.17958
H  4.822348 -0.358629 -1.935397
H  0.009511 3.034603 0.861223
H  1.103943 3.376116 -0.463223
H  -0.762531 2.926659 -2.091322
H  -1.014373 4.304462 -1.041982
H  1.805559 -4.028147 1.607637
H  1.606021 -2.467425 -2.292461
H  -2.484973 4.029133 1.028496
H  -2.357921 1.097353 -2.086658
H  2.212386 -6.033795 -0.221391
H  -4.581964 3.065833 1.857316
H  -4.454851 0.125161 -1.261981
elementType: Cl O N C H
totalener: -1513.52243677 hartree
nucrepener: 2388.15106042 hartree
electener: -3901.67349719 hartree
oneelecener: -6813.64269578 hartree
twoeener: 2911.96919859 hartree
cpcmener: -0.03234989 hartree
kineticenergy: 1508.15573258 hartree
xcener: -124.304902697927 hartree
chargesum: 0.0000000
charge: -0.105956 -0.373758 -0.458047 -0.061010 -0.030853 -0.373662 0.294311 0.102780 0.073533 -0.214867 -0.336449 -0.322489 -0.347822 -0.126307 0.367967 -0.091484 0.044644 -0.142434 0.023616 -0.222720 -0.215261 -0.117559 -0.144393 -0.128346 0.080438 0.083587 0.108337 0.098944 0.089386 0.105745 0.114697 0.108053 0.101100 0.110816 0.119447 0.112413 0.114362 0.107310 0.080063 0.084643 0.089266 0.102951 0.183166 0.178080 0.141391 0.142245 0.164495 0.142702 0.142928
qa: -0.1060 -0.3738 -0.4580 -0.0610 -0.0309 -0.3737 0.2943 0.1028 0.0735 -0.2149 -0.3364 -0.3225 -0.3478 -0.1263 0.3680 -0.0915 0.0446 -0.1424 0.0236 -0.2227 -0.2153 -0.1176 -0.1444 -0.1283 0.0804 0.0836 0.1083 0.0989 0.0894 0.1057 0.1147 0.1081 0.1011 0.1108 0.1194 0.1124 0.1144 0.1073 0.0801 0.0846 0.0893 0.1030 0.1832 0.1781 0.1414 0.1422 0.1645 0.1427 0.1429
va: 1.1990 1.9710 2.0544 3.1366 3.2647 3.1068 4.0714 3.9374 3.9174 3.8359 3.9433 3.9345 3.9462 3.8620 4.2531 3.8283 3.5537 3.9132 4.0497 3.9904 3.9415 4.0161 3.9766 3.9692 3.8345 1.0022 0.9919 1.0287 1.0157 1.0041 1.0195 1.0063 0.9963 1.0021 1.0041 1.0014 1.0054 1.0039 1.0082 1.0310 1.0114 1.0049 0.9945 0.9879 1.0027 1.0018 1.0005 1.0049 1.0042
dispcorr: -0.028221670 hartree
energy: -1513.550658442972
dipole: 36.31709 -33.61740 2.69969 6.92956 -5.14169 1.78787 -2.98062 3.28310 0.30248
magnitude: 3.25212 au
magnitude: 8.26622 debye
