program: Orca
programVersion: 4.2.1
elementType: Cl O O N N N C C C C C C C C C C C C C C C C C C C H H H H H H H H H H H H H H H H H H H H H H H H
charge: 0
multiplicity: 1
keywords: wb97x-d3
keywords: def2-TZVPP
keywords: def2/J RIJCOSX GRIDX6 NOFINALGRIDX
keywords: grid4 nofinalgrid
keywords: scfconv7
keywords: smallprint printgap noloewdin
keywords: NOSOSCF
formula: C19H24ClN3O2
InChI: InChI=1S/C19H24ClN3O2/c1-18(2)13-25-19(3,23(18)17(24)22-12-11-21-14-22)10-4-5-15-6-8-16(20)9-7-15/h6-9,11-12,14H,4-5,10,13H2,1-3H3
49 atoms
Cl -6.140944 1.598916 -1.360335
O  2.326519 1.70321 -0.06931
O  2.583848 -1.70947 2.24059
N  2.216574 -0.504809 0.349543
N  1.871906 -2.82529 0.400066
N  0.556363 -4.4004 -0.39476
C  2.429048 0.814706 1.0140
C  2.282277 -0.362692 -1.131605
C  2.855968 1.055905 -1.197367
C  1.337967 1.14002 2.033127
C  3.81415 0.933929 1.648614
C  3.234577 -1.337252 -1.8102
C  0.913922 -0.386189 -1.803111
C  -0.104516 1.082956 1.533166
C  2.262375 -1.62896 1.074076
C  -0.613865 2.38286 0.903195
C  -1.99768 2.227893 0.339753
C  2.633807 -3.965275 0.323835
C  0.622174 -3.155433 -0.024624
C  -2.208999 2.174296 -1.034753
C  -3.103659 2.08905 1.176429
C  1.808298 -4.914831 -0.191096
C  -3.475795 1.983068 -1.567924
C  -4.377291 1.896435 0.66529
C  -4.552039 1.842052 -0.70905
H  3.953289 1.040942 -1.182519
H  2.539508 1.588833 -2.093896
H  1.555923 2.134836 2.434248
H  1.458093 0.457637 2.874655
H  3.905658 0.336047 2.550491
H  3.987246 1.976135 1.919698
H  4.607943 0.629402 0.965414
H  2.803482 -2.32562 -1.9584
H  4.1706 -1.442258 -1.260238
H  3.4801 -0.950406 -2.801032
H  1.027331 -0.137308 -2.859262
H  0.441952 -1.364636 -1.761975
H  0.230534 0.340899 -1.3650
H  -0.232404 0.255618 0.829882
H  -0.74826 0.837781 2.381489
H  0.062579 2.713026 0.115461
H  -0.608254 3.16721 1.665502
H  3.671279 -3.985606 0.610816
H  -0.198608 -2.456341 -0.00056
H  -1.372196 2.291956 -1.712841
H  -2.976236 2.135051 2.2515
H  2.048973 -5.939098 -0.428713
H  -3.615123 1.946638 -2.639878
H  -5.22177 1.792466 1.333114
elementType: Cl O N C H
totalener: -1513.51937713 hartree
nucrepener: 2416.96960015 hartree
electener: -3930.48897728 hartree
oneelecener: -6870.68693570 hartree
twoeener: 2940.19795842 hartree
cpcmener: -0.03042763 hartree
kineticenergy: 1508.17192083 hartree
xcener: -124.308574978605 hartree
chargesum: -0.0000000
charge: -0.105776 -0.378307 -0.451744 -0.065939 -0.025672 -0.375725 0.250428 0.124697 0.074920 -0.158611 -0.316388 -0.337725 -0.343678 -0.160681 0.357853 -0.088298 0.015623 -0.152162 0.030166 -0.188674 -0.210883 -0.110181 -0.156163 -0.152332 0.090183 0.085127 0.108860 0.095140 0.116351 0.109724 0.108260 0.100037 0.104726 0.112419 0.120757 0.114979 0.124755 0.072781 0.070360 0.103209 0.099499 0.095517 0.183570 0.176051 0.143842 0.141030 0.164354 0.141464 0.142259
qa: -0.1058 -0.3783 -0.4517 -0.0659 -0.0257 -0.3757 0.2504 0.1247 0.0749 -0.1586 -0.3164 -0.3377 -0.3437 -0.1607 0.3579 -0.0883 0.0156 -0.1522 0.0302 -0.1887 -0.2109 -0.1102 -0.1562 -0.1523 0.0902 0.0851 0.1089 0.0951 0.1164 0.1097 0.1083 0.1000 0.1047 0.1124 0.1208 0.1150 0.1248 0.0728 0.0704 0.1032 0.0995 0.0955 0.1836 0.1761 0.1438 0.1410 0.1644 0.1415 0.1423
va: 1.1995 1.9681 2.0628 3.1292 3.2495 3.1075 4.1091 3.9071 3.8781 3.7593 3.9301 3.9540 3.9486 3.9038 4.2561 3.7514 3.5782 3.9191 4.0433 3.9519 4.0013 4.0146 4.0086 3.9883 3.8284 1.0030 0.9941 1.0136 1.0224 1.0210 1.0099 1.0039 0.9945 1.0007 1.0030 1.0059 1.0026 1.0087 1.0172 1.0117 1.0274 1.0111 0.9953 0.9883 0.9984 1.0027 1.0008 1.0067 1.0054
dispcorr: -0.029918900 hartree
energy: -1513.549296033401
dipole: 31.98845 -29.83907 2.14938 2.54844 -0.92480 1.62364 1.36881 -2.20476 -0.83595
magnitude: 2.82044 au
magnitude: 7.16898 debye
