program: Orca
programVersion: 4.2.1
elementType: Cl O O N N N C C C C C C C C C C C C C C C C C C C H H H H H H H H H H H H H H H H H H H H H H H H
charge: 0
multiplicity: 1
keywords: wb97x-d3
keywords: def2-TZVPP
keywords: def2/J RIJCOSX GRIDX6 NOFINALGRIDX
keywords: grid4 nofinalgrid
keywords: scfconv7
keywords: smallprint printgap noloewdin
keywords: NOSOSCF
formula: C19H24ClN3O2
InChI: InChI=1S/C19H24ClN3O2/c1-18(2)13-25-19(3,23(18)17(24)22-12-11-21-14-22)10-4-5-15-6-8-16(20)9-7-15/h6-9,11-12,14H,4-5,10,13H2,1-3H3
49 atoms
Cl -4.118589 1.58699 -2.879259
O  1.837239 1.457678 -0.211962
O  1.575082 -1.670041 2.468195
N  1.646033 -0.688806 0.421689
N  1.611731 -3.024259 0.647934
N  2.400721 -4.886576 -0.218831
C  1.756533 0.697519 0.96659
C  1.300567 -0.647907 -1.026448
C  0.991218 0.848993 -1.151623
C  0.49539 1.064207 1.767109
C  3.038612 0.925856 1.742237
C  2.485406 -0.995708 -1.921517
C  0.06599 -1.454695 -1.402175
C  0.313486 2.563779 2.000238
C  1.60412 -1.730953 1.256978
C  -1.162336 2.941063 2.190842
C  -1.969811 2.645847 0.956989
C  0.635311 -3.974882 0.818317
C  2.660761 -3.637639 0.037264
C  -2.820756 1.546238 0.89154
C  -1.815964 3.422564 -0.190264
C  1.134959 -5.106666 0.253367
C  -3.486914 1.212964 -0.279863
C  -2.475328 3.110435 -1.368646
C  -3.302751 1.99841 -1.404735
H  1.22182 1.236783 -2.14368
H  -0.067194 1.057511 -0.945818
H  0.512275 0.544822 2.724165
H  -0.373022 0.66916 1.234118
H  3.907183 0.604315 1.166613
H  3.035767 0.39763 2.6923
H  3.152766 1.989045 1.958131
H  2.235504 -0.767787 -2.958668
H  2.738869 -2.052748 -1.886042
H  3.373171 -0.42031 -1.656814
H  -0.292803 -1.109474 -2.373921
H  0.259708 -2.521094 -1.500044
H  -0.745375 -1.310202 -0.686671
H  0.875367 2.882428 2.881387
H  0.707982 3.138828 1.160233
H  -1.225348 4.00482 2.43255
H  -1.57784 2.401446 3.045559
H  -0.309139 -3.755261 1.287328
H  3.591388 -3.128135 -0.156742
H  -2.963755 0.924984 1.767723
H  -1.164144 4.288306 -0.172075
H  0.650881 -6.066279 0.161052
H  -4.136521 0.34844 -0.309402
H  -2.340013 3.725419 -2.248329
elementType: Cl O N C H
totalener: -1513.52030843 hartree
nucrepener: 2473.06015951 hartree
electener: -3986.58046795 hartree
oneelecener: -6982.70909810 hartree
twoeener: 2996.12863015 hartree
cpcmener: -0.02970751 hartree
kineticenergy: 1508.15736196 hartree
xcener: -124.306852466994 hartree
chargesum: 0.0000000
charge: -0.105295 -0.382846 -0.457680 -0.076420 -0.033102 -0.377478 0.362186 0.098850 0.116725 -0.260334 -0.297573 -0.347958 -0.340814 -0.161290 0.376202 -0.100959 0.048655 -0.155315 0.027228 -0.189286 -0.222217 -0.113413 -0.158062 -0.138073 0.102952 0.119054 0.016516 0.113484 0.069674 0.106530 0.104272 0.110599 0.107673 0.116547 0.115330 0.119970 0.110245 0.107802 0.093739 0.087542 0.101697 0.087281 0.183955 0.180512 0.145890 0.138722 0.164917 0.141798 0.141569
qa: -0.1053 -0.3828 -0.4577 -0.0764 -0.0331 -0.3775 0.3622 0.0989 0.1167 -0.2603 -0.2976 -0.3480 -0.3408 -0.1613 0.3762 -0.1010 0.0487 -0.1553 0.0272 -0.1893 -0.2222 -0.1134 -0.1581 -0.1381 0.1030 0.1191 0.0165 0.1135 0.0697 0.1065 0.1043 0.1106 0.1077 0.1165 0.1153 0.1200 0.1102 0.1078 0.0937 0.0875 0.1017 0.0873 0.1840 0.1805 0.1459 0.1387 0.1649 0.1418 0.1416
va: 1.2002 1.9793 2.0540 3.1742 3.2564 3.1035 4.0266 3.9648 3.9159 3.8636 3.9195 3.9443 3.9439 3.8496 4.2466 3.8735 3.5914 3.9196 4.0384 3.9030 3.9363 4.0165 3.9667 3.9538 3.7960 0.9941 1.0241 1.0384 1.0130 1.0109 1.0160 1.0012 1.0031 1.0016 1.0055 1.0047 0.9974 0.9983 1.0084 1.0306 1.0050 1.0080 0.9941 0.9859 1.0001 1.0043 1.0007 1.0050 1.0049
dispcorr: -0.031115329 hartree
energy: -1513.551423764387
dipole: 16.44047 -16.97200 -0.53153 4.18491 -2.22656 1.95835 8.97079 -9.27744 -0.30665
magnitude: 2.05224 au
magnitude: 5.21638 debye
